program: Orca
programVersion: 5.0.2
elementType: Cl Cl F F F F F F F F F O O O N N C C C C C C C C C C C C C C C C C H H H H H H H
charge: 0
multiplicity: 1
keywords: wb97x-d3
keywords: def2-TZVPP
keywords: def2/J RIJCOSX
keywords: DEFGRID2
keywords: scfconv7
keywords: smallprint printgap noloewdin
keywords: NOSOSCF
formula: C17H7Cl2F9N2O3
InChI: InChI=1/C17H7Cl2F9N2O3/c18-5-4-8(29-15(32)30-13(31)9-6(20)2-1-3-7(9)21)11(22)10(19)12(5)33-17(27,28)14(23)16(24,25)26/h1-4,14,29-30H
40 atoms
Cl 2.123064 -2.173131 1.402975
Cl 2.343283 3.065813 0.176917
F  5.681874 -1.065826 1.144477
F  3.782302 -1.04563 -0.876112
F  4.162002 1.031852 -1.24242
F  6.79265 0.4414 -1.827118
F  6.380885 -1.643909 -1.464253
F  7.888746 -0.634229 -0.318292
F  -0.703573 -1.765436 1.089979
F  -6.732703 1.709397 1.104571
F  -5.98808 -2.174867 -1.384409
O  3.484075 0.403102 0.794913
O  -2.542062 2.423349 -0.594415
O  -4.265895 -1.103882 0.667856
N  -2.067967 0.42659 0.411089
N  -4.230569 0.97934 -0.250545
C  5.678576 -0.079527 0.191648
C  4.237358 0.078262 -0.296844
C  2.120773 0.430538 0.6664
C  -0.683887 0.505386 0.496288
C  6.689333 -0.488305 -0.87984
C  1.372693 -0.713378 0.924026
C  1.452225 1.608757 0.377301
C  -0.002307 -0.661422 0.836659
C  0.070383 1.656489 0.295441
C  -2.883884 1.342739 -0.15955
C  -6.305755 -0.226147 -0.134712
C  -4.84476 -0.170317 0.144719
C  -7.207816 0.702287 0.366703
C  -6.833131 -1.273556 -0.880174
C  -8.566047 0.612894 0.149805
C  -8.181107 -1.395472 -1.137982
C  -9.042094 -0.443044 -0.612047
H  6.006037 0.864946 0.635936
H  -0.406245 2.597154 0.078937
H  -2.510293 -0.444438 0.696223
H  -4.793941 1.67981 -0.718232
H  -9.234802 1.351527 0.569952
H  -8.549355 -2.215617 -1.738833
H  -10.103504 -0.525782 -0.799369
elementType: Cl F O N C H
totalener: -2806.51519847 hartree
nucrepener: 3861.06234106 hartree
electener: -6667.57753953 hartree
twoeener: 4891.51684936 hartree
cpcmener: -0.03753631 hartree
kineticenergy: 2798.64776221 hartree
xcener: -203.040162900902 hartree
chargesum: -0.0000000
charge: -0.033635 -0.053088 -0.206419 -0.177226 -0.176918 -0.162579 -0.162417 -0.163519 -0.199733 -0.207666 -0.203912 -0.310304 -0.501070 -0.459051 -0.168999 -0.149070 0.127278 0.448478 0.232006 0.045372 0.458331 -0.031389 -0.015966 0.252249 -0.131431 0.441409 -0.127175 0.415714 0.318052 0.297280 -0.244086 -0.241290 -0.063192 0.142661 0.143459 0.187651 0.199600 0.155275 0.155166 0.170154
qa: -0.0336 -0.0531 -0.2064 -0.1772 -0.1769 -0.1626 -0.1624 -0.1635 -0.1997 -0.2077 -0.2039 -0.3103 -0.5011 -0.4591 -0.1690 -0.1491 0.1273 0.4485 0.2320 0.0454 0.4583 -0.0314 -0.0160 0.2522 -0.1314 0.4414 -0.1272 0.4157 0.3181 0.2973 -0.2441 -0.2413 -0.0632 0.1427 0.1435 0.1877 0.1996 0.1553 0.1552 0.1702
va: 1.2772 1.2569 1.0770 1.1283 1.1338 1.1513 1.1501 1.1487 1.1077 1.0875 1.0946 2.1156 2.0057 2.0545 3.2327 3.2330 3.9656 4.3501 3.8167 3.9648 4.4833 4.0206 4.0860 4.0076 3.9849 4.2966 3.5445 4.0583 3.9243 3.9555 3.9585 3.9548 3.8075 1.0072 1.0427 1.0704 1.0043 1.0000 0.9997 0.9835
dispcorr: -0.020268273 hartree
energy: -2806.535466743886
dipole: -53.57994 49.94924 -3.63070 6.72637 -5.86243 0.86394 0.22090 -0.37654 -0.15564
magnitude: 3.73532 au
magnitude: 9.49442 debye
