program: Orca
programVersion: 5.0.2
elementType: Cl Cl F F F F F F F F F O O O N N C C C C C C C C C C C C C C C C C H H H H H H H
charge: 0
multiplicity: 1
keywords: wb97x-d3
keywords: def2-TZVPP
keywords: def2/J RIJCOSX
keywords: DEFGRID2
keywords: scfconv7
keywords: smallprint printgap noloewdin
keywords: NOSOSCF
formula: C17H7Cl2F9N2O3
InChI: InChI=1/C17H7Cl2F9N2O3/c18-5-4-8(29-15(32)30-13(31)9-6(20)2-1-3-7(9)21)11(22)10(19)12(5)33-17(27,28)14(23)16(24,25)26/h1-4,14,29-30H
40 atoms
Cl 2.350438 -0.221811 2.715473
Cl 2.072158 1.977667 -2.195174
F  5.860909 0.127381 1.352643
F  3.874268 -1.287371 0.240164
F  4.027048 -0.236486 -1.621126
F  6.466316 -1.966953 -0.478284
F  7.920166 -0.410939 -0.202983
F  6.7273 -0.457303 -1.994657
F  -0.509796 -0.286774 2.468489
F  -6.472273 -0.488628 2.01267
F  -6.331696 0.503579 -2.546006
O  3.454431 0.904194 0.213861
O  -2.196389 -1.785108 0.768109
O  -4.466388 1.399102 -0.52281
N  -2.085535 0.431827 0.277008
N  -4.117454 -0.708358 0.272304
C  5.681919 0.238392 -0.000662
C  4.220318 -0.105683 -0.297429
C  2.092434 0.753655 0.210267
C  -0.690082 0.517114 0.265705
C  6.705068 -0.672397 -0.680926
C  1.456518 0.228504 1.329294
C  1.32532 1.203956 -0.855888
C  0.075608 0.139394 1.358696
C  -0.050445 1.069306 -0.833788
C  -2.733027 -0.740678 0.459303
C  -6.351003 0.007926 -0.264386
C  -4.895659 0.313568 -0.183036
C  -7.103034 -0.356341 0.843128
C  -7.034336 0.166973 -1.462845
C  -8.464967 -0.56004 0.784137
C  -8.392458 -0.035334 -1.574591
C  -9.100632 -0.396442 -0.437187
H  5.876343 1.268175 -0.315198
H  -0.641935 1.398688 -1.677498
H  -2.604653 1.198816 -0.140491
H  -4.566269 -1.598675 0.450551
H  -9.015341 -0.835247 1.673305
H  -8.885538 0.085897 -2.529267
H  -10.167823 -0.553603 -0.504932
elementType: Cl F O N C H
totalener: -2806.51381791 hartree
nucrepener: 3864.32557530 hartree
electener: -6670.83939321 hartree
twoeener: 4895.07903890 hartree
cpcmener: -0.04381399 hartree
kineticenergy: 2798.66691748 hartree
xcener: -203.039104456393 hartree
chargesum: -0.0000000
charge: -0.034374 -0.049962 -0.205578 -0.175976 -0.176409 -0.163197 -0.163072 -0.162345 -0.187015 -0.207478 -0.204132 -0.306648 -0.505912 -0.460422 -0.211854 -0.155616 0.128268 0.447240 0.235959 0.083957 0.460561 -0.006374 0.008248 0.209248 -0.157191 0.434982 -0.138356 0.422319 0.312599 0.304807 -0.242259 -0.242534 -0.065106 0.139420 0.139757 0.211923 0.202440 0.155567 0.154432 0.170084
qa: -0.0344 -0.0500 -0.2056 -0.1760 -0.1764 -0.1632 -0.1631 -0.1623 -0.1870 -0.2075 -0.2041 -0.3066 -0.5059 -0.4604 -0.2119 -0.1556 0.1283 0.4472 0.2360 0.0840 0.4606 -0.0064 0.0082 0.2092 -0.1572 0.4350 -0.1384 0.4223 0.3126 0.3048 -0.2423 -0.2425 -0.0651 0.1394 0.1398 0.2119 0.2024 0.1556 0.1544 0.1701
va: 1.2777 1.2568 1.0788 1.1306 1.1342 1.1499 1.1498 1.1503 1.1292 1.0875 1.0942 2.1210 2.0072 2.0461 3.1584 3.2202 3.9632 4.3531 3.8399 3.7276 4.4719 3.9615 4.0301 4.1702 4.1202 4.3198 3.5409 4.0640 3.9290 3.9483 3.9582 3.9549 3.8082 1.0081 1.0205 1.0330 1.0017 0.9995 1.0001 0.9835
dispcorr: -0.020413831 hartree
energy: -2806.534231742999
dipole: -54.15841 50.54890 -3.60950 2.75448 -1.83816 0.91632 -2.83373 1.84438 -0.98934
magnitude: 3.85317 au
magnitude: 9.79399 debye
