program: Orca
programVersion: 5.0.2
elementType: Cl Cl F F F F F F F F F O O O N N C C C C C C C C C C C C C C C C C H H H H H H H
charge: 0
multiplicity: 1
keywords: wb97x-d3
keywords: def2-TZVPP
keywords: def2/J RIJCOSX
keywords: DEFGRID2
keywords: scfconv7
keywords: smallprint printgap noloewdin
keywords: NOSOSCF
formula: C17H7Cl2F9N2O3
InChI: InChI=1/C17H7Cl2F9N2O3/c18-5-4-8(29-15(32)30-13(31)9-6(20)2-1-3-7(9)21)11(22)10(19)12(5)33-17(27,28)14(23)16(24,25)26/h1-4,14,29-30H
40 atoms
Cl 2.116833 -2.094435 1.559156
Cl 2.345099 3.042158 -0.04167
F  5.784428 -0.769663 1.289574
F  3.866502 -1.16631 -0.732938
F  4.106846 0.875384 -1.332148
F  6.702289 0.241884 -1.944954
F  6.533763 -1.747812 -1.12933
F  7.950614 -0.36537 -0.297026
F  -0.698056 -1.732298 1.138446
F  -6.659803 1.743094 1.049864
F  -6.083279 -2.252736 -1.306623
O  3.48511 0.435112 0.773065
O  -2.555892 2.384949 -0.730372
O  -4.248867 -1.132892 0.601325
N  -2.057188 0.391942 0.272014
N  -4.231603 0.932936 -0.355876
C  5.704261 0.048343 0.192014
C  4.251444 0.042513 -0.287205
C  2.123725 0.445941 0.62321
C  -0.676916 0.491108 0.384569
C  6.727727 -0.467731 -0.818702
C  1.375156 -0.680498 0.947619
C  1.456154 1.596853 0.237268
C  0.002837 -0.643424 0.824229
C  0.076726 1.629606 0.117198
C  -2.885076 1.302652 -0.289313
C  -6.312867 -0.247314 -0.128161
C  -4.840708 -0.202706 0.086486
C  -7.179586 0.71449 0.374097
C  -6.889211 -1.317189 -0.802646
C  -8.54703 0.637818 0.221035
C  -8.248814 -1.429048 -0.994316
C  -9.071914 -0.441892 -0.472406
H  5.972912 1.071432 0.47208
H  -0.39788 2.547459 -0.185004
H  -2.49423 -0.47627 0.573944
H  -4.804958 1.627751 -0.819274
H  -9.185832 1.404308 0.638024
H  -8.654611 -2.269456 -1.540677
H  -10.14181 -0.516414 -0.608016
elementType: Cl F O N C H
totalener: -2806.51539932 hartree
nucrepener: 3858.40743879 hartree
electener: -6664.92283811 hartree
twoeener: 4888.83364021 hartree
cpcmener: -0.03744859 hartree
kineticenergy: 2798.64365930 hartree
xcener: -203.039806138194 hartree
chargesum: 0.0000000
charge: -0.033841 -0.052342 -0.206682 -0.178083 -0.176680 -0.162396 -0.162471 -0.163670 -0.200359 -0.207687 -0.203312 -0.310711 -0.501559 -0.459409 -0.163601 -0.148832 0.127009 0.449397 0.234210 0.039191 0.459475 -0.036411 -0.020086 0.255506 -0.125788 0.440170 -0.127458 0.416721 0.314545 0.299409 -0.242416 -0.241264 -0.062932 0.142264 0.144862 0.186059 0.198496 0.155593 0.154839 0.170246
qa: -0.0338 -0.0523 -0.2067 -0.1781 -0.1767 -0.1624 -0.1625 -0.1637 -0.2004 -0.2077 -0.2033 -0.3107 -0.5016 -0.4594 -0.1636 -0.1488 0.1270 0.4494 0.2342 0.0392 0.4595 -0.0364 -0.0201 0.2555 -0.1258 0.4402 -0.1275 0.4167 0.3145 0.2994 -0.2424 -0.2413 -0.0629 0.1423 0.1449 0.1861 0.1985 0.1556 0.1548 0.1702
va: 1.2754 1.2583 1.0768 1.1292 1.1328 1.1518 1.1501 1.1484 1.1066 1.0876 1.0951 2.1171 2.0059 2.0543 3.2357 3.2345 3.9665 4.3503 3.8157 3.9865 4.4838 4.0312 4.0870 3.9945 3.9659 4.2974 3.5466 4.0562 3.9249 3.9538 3.9580 3.9547 3.8086 1.0075 1.0440 1.0724 1.0052 0.9998 0.9999 0.9834
dispcorr: -0.020238712 hartree
energy: -2806.535638033438
dipole: -53.86599 50.15786 -3.70813 6.75024 -5.84011 0.91012 -0.36395 0.10294 -0.26101
magnitude: 3.82710 au
magnitude: 9.72772 debye
