program: Orca
programVersion: 5.0.2
elementType: Cl Cl F F F F F F F F F O O O N N C C C C C C C C C C C C C C C C C H H H H H H H
charge: 0
multiplicity: 1
keywords: wb97x-d3
keywords: def2-TZVPP
keywords: def2/J RIJCOSX
keywords: DEFGRID2
keywords: scfconv7
keywords: smallprint printgap noloewdin
keywords: NOSOSCF
formula: C17H7Cl2F9N2O3
InChI: InChI=1/C17H7Cl2F9N2O3/c18-5-4-8(29-15(32)30-13(31)9-6(20)2-1-3-7(9)21)11(22)10(19)12(5)33-17(27,28)14(23)16(24,25)26/h1-4,14,29-30H
40 atoms
Cl 2.507529 0.182258 2.315663
Cl 2.123133 -1.237809 -2.865221
F  6.461543 1.378358 -0.979613
F  3.935188 1.044373 -1.95896
F  4.013087 1.646317 0.086076
F  5.904322 0.40191 1.657359
F  7.589934 -0.387905 0.586985
F  5.804898 -1.571114 0.796668
F  -0.357737 0.172056 2.174489
F  -6.314209 0.107006 2.28223
F  -6.415577 -0.446749 -2.34949
O  3.547676 -0.492879 -0.380547
O  -2.187048 1.797165 0.758801
O  -4.392846 -1.434801 -0.535956
N  -1.99425 -0.331858 -0.009812
N  -4.082622 0.639668 0.355852
C  5.752772 0.234866 -0.720023
C  4.26863 0.609837 -0.730092
C  2.184508 -0.399784 -0.305591
C  -0.599074 -0.326417 -0.108152
C  6.259437 -0.334858 0.606641
C  1.579079 -0.084031 0.904927
C  1.391919 -0.721306 -1.398634
C  0.198718 -0.065601 0.995818
C  0.012815 -0.669941 -1.304425
C  -2.689825 0.754941 0.390271
C  -6.315085 -0.159884 -0.037426
C  -4.844743 -0.397773 -0.090645
C  -7.008228 0.075229 1.140716
C  -7.063581 -0.222945 -1.205031
C  -8.375787 0.249481 1.175533
C  -8.428761 -0.038131 -1.224239
C  -9.076844 0.195758 -0.020052
H  5.941329 -0.497936 -1.509379
H  -0.600528 -0.903612 -2.164106
H  -2.501886 -1.100315 -0.437972
H  -4.560634 1.478897 0.661563
H  -8.881346 0.419352 2.116339
H  -8.972036 -0.075429 -2.158551
H  -10.148936 0.335557 -0.01342
elementType: Cl F O N C H
totalener: -2806.51433125 hartree
nucrepener: 3897.69557898 hartree
electener: -6704.20991024 hartree
twoeener: 4928.44396639 hartree
cpcmener: -0.04398737 hartree
kineticenergy: 2798.66394748 hartree
xcener: -203.039732606424 hartree
chargesum: -0.0000000
charge: -0.033819 -0.050464 -0.206773 -0.176116 -0.175032 -0.162291 -0.164070 -0.161897 -0.187724 -0.207572 -0.204488 -0.320458 -0.506633 -0.459872 -0.208966 -0.156331 0.135320 0.444676 0.262456 0.077856 0.461443 -0.014004 0.002760 0.215971 -0.158124 0.434086 -0.137011 0.419601 0.316986 0.299693 -0.244344 -0.242202 -0.065227 0.134833 0.140818 0.212672 0.203658 0.155203 0.155019 0.170367
qa: -0.0338 -0.0505 -0.2068 -0.1761 -0.1750 -0.1623 -0.1641 -0.1619 -0.1877 -0.2076 -0.2045 -0.3205 -0.5066 -0.4599 -0.2090 -0.1563 0.1353 0.4447 0.2625 0.0779 0.4614 -0.0140 0.0028 0.2160 -0.1581 0.4341 -0.1370 0.4196 0.3170 0.2997 -0.2443 -0.2422 -0.0652 0.1348 0.1408 0.2127 0.2037 0.1552 0.1550 0.1704
va: 1.2782 1.2561 1.0811 1.1307 1.1295 1.1502 1.1484 1.1483 1.1293 1.0871 1.0938 2.1064 2.0073 2.0465 3.1531 3.2174 3.9544 4.3770 3.7879 3.7111 4.4623 3.9884 4.0502 4.1634 4.1256 4.3224 3.5396 4.0662 3.9307 3.9531 3.9577 3.9572 3.8062 1.0093 1.0187 1.0307 1.0009 0.9998 0.9997 0.9834
dispcorr: -0.020931945 hartree
energy: -2806.535263198092
dipole: -53.29533 49.68705 -3.60828 -1.13289 0.35738 -0.77551 -4.68089 3.52237 -1.15853
magnitude: 3.86824 au
magnitude: 9.83229 debye
