program: Orca
programVersion: 5.0.2
elementType: Cl Cl F F F F F F F F F O O O N N C C C C C C C C C C C C C C C C C H H H H H H H
charge: 0
multiplicity: 1
keywords: wb97x-d3
keywords: def2-TZVPP
keywords: def2/J RIJCOSX
keywords: DEFGRID2
keywords: scfconv7
keywords: smallprint printgap noloewdin
keywords: NOSOSCF
formula: C17H7Cl2F9N2O3
InChI: InChI=1/C17H7Cl2F9N2O3/c18-5-4-8(29-15(32)30-13(31)9-6(20)2-1-3-7(9)21)11(22)10(19)12(5)33-17(27,28)14(23)16(24,25)26/h1-4,14,29-30H
40 atoms
Cl 2.307648 -1.907866 1.346458
Cl 2.345768 1.845247 -2.511713
F  6.494929 1.386347 0.821615
F  4.037729 2.100722 0.018471
F  4.005204 0.60922 1.548698
F  6.001404 -1.298053 1.466615
F  7.608259 -0.904007 0.099093
F  5.755348 -1.722859 -0.630727
F  -0.53331 -1.520588 1.206032
F  -6.168599 -0.116985 2.524385
F  -6.479733 -0.306931 -2.134586
O  3.577645 -0.008703 -0.559384
O  -2.562651 1.96844 -1.537411
O  -4.149238 -1.102035 0.7153
N  -1.983636 0.119321 -0.324545
N  -4.20594 0.768973 -0.580302
C  5.79382 0.559681 -0.018102
C  4.309148 0.803734 0.253255
C  2.211561 0.067536 -0.499121
C  -0.599505 0.154184 -0.438499
C  6.283583 -0.865524 0.239491
C  1.503754 -0.766424 0.358737
C  1.50164 0.900133 -1.349149
C  0.125837 -0.711127 0.37881
C  0.117438 0.950368 -1.326432
C  -2.855682 1.006042 -0.857952
C  -6.267609 -0.195259 0.192077
C  -4.779742 -0.238265 0.13539
C  -6.915991 -0.16374 1.420869
C  -7.072195 -0.243211 -0.938829
C  -8.28891 -0.151494 1.537073
C  -8.449177 -0.249847 -0.872303
C  -9.048246 -0.197443 0.377027
H  6.010603 0.821865 -1.057783
H  -0.390285 1.60868 -2.010599
H  -2.391889 -0.608899 0.257259
H  -4.816099 1.47113 -0.981654
H  -8.753506 -0.106817 2.512445
H  -9.038278 -0.297664 -1.777655
H  -10.126898 -0.194419 0.448392
elementType: Cl F O N C H
totalener: -2806.51590516 hartree
nucrepener: 3885.91453138 hartree
electener: -6692.43043654 hartree
twoeener: 4916.28237241 hartree
cpcmener: -0.03740652 hartree
kineticenergy: 2798.63939750 hartree
xcener: -203.039476816328 hartree
chargesum: 0.0000000
charge: -0.033468 -0.052275 -0.206906 -0.176863 -0.176650 -0.163840 -0.164315 -0.161682 -0.199261 -0.203309 -0.207218 -0.321453 -0.500956 -0.458339 -0.166223 -0.149060 0.137822 0.447498 0.247097 0.041762 0.459025 -0.037240 -0.020960 0.247188 -0.119329 0.439520 -0.129254 0.414672 0.300868 0.313744 -0.241758 -0.241963 -0.063858 0.135846 0.142898 0.188239 0.199692 0.155033 0.155090 0.170188
qa: -0.0335 -0.0523 -0.2069 -0.1769 -0.1767 -0.1638 -0.1643 -0.1617 -0.1993 -0.2033 -0.2072 -0.3215 -0.5010 -0.4583 -0.1662 -0.1491 0.1378 0.4475 0.2471 0.0418 0.4590 -0.0372 -0.0210 0.2472 -0.1193 0.4395 -0.1293 0.4147 0.3009 0.3137 -0.2418 -0.2420 -0.0639 0.1358 0.1429 0.1882 0.1997 0.1550 0.1551 0.1702
va: 1.2768 1.2574 1.0802 1.1299 1.1287 1.1491 1.1479 1.1496 1.1083 1.0952 1.0879 2.1101 2.0053 2.0548 3.2346 3.2304 3.9585 4.3720 3.7804 3.9701 4.4661 4.0400 4.1083 4.0079 3.9784 4.2976 3.5485 4.0604 3.9559 3.9269 3.9574 3.9552 3.8071 1.0094 1.0416 1.0691 1.0042 0.9998 0.9998 0.9835
dispcorr: -0.020681073 hartree
energy: -2806.536586228679
dipole: -53.18629 49.39437 -3.79192 4.27925 -3.97519 0.30407 -5.48583 4.58262 -0.90321
magnitude: 3.90985 au
magnitude: 9.93805 debye
