program: Orca
programVersion: 5.0.2
elementType: Cl Cl F F F F F F F F F O O O N N C C C C C C C C C C C C C C C C C H H H H H H H
charge: 0
multiplicity: 1
keywords: wb97x-d3
keywords: def2-TZVPP
keywords: def2/J RIJCOSX
keywords: DEFGRID2
keywords: scfconv7
keywords: smallprint printgap noloewdin
keywords: NOSOSCF
formula: C17H7Cl2F9N2O3
InChI: InChI=1/C17H7Cl2F9N2O3/c18-5-4-8(29-15(32)30-13(31)9-6(20)2-1-3-7(9)21)11(22)10(19)12(5)33-17(27,28)14(23)16(24,25)26/h1-4,14,29-30H
40 atoms
Cl 2.104603 -2.465934 -1.613931
Cl 2.565661 2.313863 0.824866
F  6.104873 -1.104469 -0.955639
F  4.038503 -0.211646 1.748059
F  4.118441 -2.031362 0.621074
F  5.964711 1.678495 1.183367
F  5.645433 1.58864 -0.944615
F  7.554553 1.047336 -0.130008
F  -0.688535 -2.047412 -1.137182
F  -6.180333 2.168234 -0.682643
F  -6.472658 -2.319004 0.557552
O  3.580098 -0.149333 -0.443816
O  -2.310347 1.493932 1.708363
O  -4.286302 -0.983344 -0.941968
N  -1.961937 0.019634 -0.000562
N  -4.105743 0.561635 0.723899
C  5.824779 -0.47957 0.231778
C  4.344534 -0.707321 0.537413
C  2.22242 -0.113424 -0.279455
C  -0.572711 0.028502 -0.047908
C  6.239209 0.984578 0.081179
C  1.426944 -1.134847 -0.783537
C  1.606835 0.98573 0.30015
C  0.055525 -1.055218 -0.654176
C  0.229842 1.067337 0.412282
C  -2.725414 0.735466 0.856364
C  -6.281421 -0.076391 -0.055527
C  -4.801197 -0.218294 -0.149448
C  -6.92989 1.115446 -0.343367
C  -7.077985 -1.166051 0.266535
C  -8.302216 1.241114 -0.311401
C  -8.45279 -1.088517 0.320272
C  -9.055317 0.12623 0.025824
H  6.417754 -0.930089 1.034192
H  -0.206909 1.951129 0.846447
H  -2.455967 -0.627075 -0.6105
H  -4.640074 1.120564 1.378995
H  -8.770468 2.186523 -0.548637
H  -9.039066 -1.956624 0.588551
H  -10.132876 0.205279 0.060444
elementType: Cl F O N C H
totalener: -2806.51508415 hartree
nucrepener: 3900.45707382 hartree
electener: -6706.97215797 hartree
twoeener: 4931.20948710 hartree
cpcmener: -0.03864778 hartree
kineticenergy: 2798.66547603 hartree
xcener: -203.043130219629 hartree
chargesum: -0.0000000
charge: -0.034102 -0.053054 -0.205846 -0.173676 -0.177277 -0.163427 -0.160665 -0.164942 -0.197326 -0.208047 -0.204363 -0.315000 -0.500642 -0.455842 -0.178736 -0.150229 0.131768 0.438856 0.245998 0.056401 0.459577 -0.035021 -0.006802 0.235711 -0.122846 0.438884 -0.127110 0.407590 0.313000 0.308616 -0.244043 -0.247273 -0.064433 0.140097 0.138598 0.192303 0.202851 0.155574 0.154712 0.170164
qa: -0.0341 -0.0531 -0.2058 -0.1737 -0.1773 -0.1634 -0.1607 -0.1649 -0.1973 -0.2080 -0.2044 -0.3150 -0.5006 -0.4558 -0.1787 -0.1502 0.1318 0.4389 0.2460 0.0564 0.4596 -0.0350 -0.0068 0.2357 -0.1228 0.4389 -0.1271 0.4076 0.3130 0.3086 -0.2440 -0.2473 -0.0644 0.1401 0.1386 0.1923 0.2029 0.1556 0.1547 0.1702
va: 1.2729 1.2614 1.0829 1.1312 1.1319 1.1501 1.1488 1.1476 1.1120 1.0867 1.0943 2.1149 2.0049 2.0552 3.2236 3.2217 3.9663 4.3739 3.7676 3.9005 4.4705 4.0307 4.0920 4.0684 4.0054 4.3009 3.5454 4.0683 3.9275 3.9505 3.9605 3.9591 3.8059 1.0045 1.0373 1.0620 1.0013 0.9995 1.0001 0.9833
dispcorr: -0.020942823 hartree
energy: -2806.536026975570
dipole: -52.02209 48.61947 -3.40262 3.09977 -2.86614 0.23363 3.40579 -2.63615 0.76964
magnitude: 3.49639 au
magnitude: 8.88712 debye
