program: Orca
programVersion: 5.0.2
elementType: Cl Cl F F F F F F F F F O O O N N C C C C C C C C C C C C C C C C C H H H H H H H
charge: 0
multiplicity: 1
keywords: wb97x-d3
keywords: def2-TZVPP
keywords: def2/J RIJCOSX
keywords: DEFGRID2
keywords: scfconv7
keywords: smallprint printgap noloewdin
keywords: NOSOSCF
formula: C17H7Cl2F9N2O3
InChI: InChI=1/C17H7Cl2F9N2O3/c18-5-4-8(29-15(32)30-13(31)9-6(20)2-1-3-7(9)21)11(22)10(19)12(5)33-17(27,28)14(23)16(24,25)26/h1-4,14,29-30H
40 atoms
Cl 2.225498 -2.304676 0.609757
Cl 2.448562 3.019092 -0.193812
F  6.140859 1.3711 -0.161696
F  3.999735 -1.075882 -1.498383
F  4.087752 1.037931 -1.845035
F  7.582045 -0.86943 0.593775
F  5.833695 -2.092401 0.296458
F  5.796268 -0.471004 1.717055
F  -0.59991 -1.856449 0.41405
F  -6.448789 1.446636 1.672128
F  -6.15552 -1.906295 -1.57199
O  3.589503 0.314747 0.206161
O  -2.550904 2.556216 -0.381119
O  -4.114641 -1.193752 0.305329
N  -1.972459 0.383167 0.032357
N  -4.195279 1.032586 -0.162182
C  5.817375 0.10778 -0.584348
C  4.325982 0.092293 -0.91777
C  2.224048 0.35628 0.102812
C  -0.586877 0.459869 0.044887
C  6.25044 -0.849519 0.524863
C  1.476667 -0.803339 0.278965
C  1.553248 1.555658 -0.073359
C  0.100678 -0.735979 0.243067
C  0.168886 1.618477 -0.101605
C  -2.84364 1.395845 -0.178265
C  -6.244857 -0.220081 0.044899
C  -4.756866 -0.183725 0.084882
C  -7.045001 0.570845 0.858834
C  -6.896154 -1.138658 -0.770458
C  -8.419488 0.468601 0.878705
C  -8.267745 -1.264827 -0.798183
C  -9.021986 -0.455125 0.038825
H  6.373357 -0.130815 -1.496698
H  -0.307365 2.575151 -0.233507
H  -2.391652 -0.53208 0.18413
H  -4.815247 1.8036 -0.37911
H  -9.002817 1.093799 1.540669
H  -8.735747 -1.981448 -1.459088
H  -10.09906 -0.547345 0.037387
elementType: Cl F O N C H
totalener: -2806.51562804 hartree
nucrepener: 3896.50608166 hartree
electener: -6703.02170969 hartree
twoeener: 4927.26019075 hartree
cpcmener: -0.03783297 hartree
kineticenergy: 2798.64981824 hartree
xcener: -203.041571306068 hartree
chargesum: -0.0000000
charge: -0.032731 -0.053222 -0.205130 -0.176656 -0.177146 -0.164664 -0.162053 -0.161617 -0.200531 -0.207191 -0.203270 -0.314541 -0.500193 -0.457603 -0.161336 -0.148523 0.121716 0.453546 0.238929 0.035984 0.460523 -0.043904 -0.013187 0.254232 -0.122015 0.438472 -0.130351 0.417226 0.315375 0.297952 -0.242193 -0.239422 -0.063219 0.138927 0.144231 0.184687 0.199057 0.154570 0.155272 0.169999
qa: -0.0327 -0.0532 -0.2051 -0.1767 -0.1771 -0.1647 -0.1621 -0.1616 -0.2005 -0.2072 -0.2033 -0.3145 -0.5002 -0.4576 -0.1613 -0.1485 0.1217 0.4535 0.2389 0.0360 0.4605 -0.0439 -0.0132 0.2542 -0.1220 0.4385 -0.1304 0.4172 0.3154 0.2980 -0.2422 -0.2394 -0.0632 0.1389 0.1442 0.1847 0.1991 0.1546 0.1553 0.1700
va: 1.2777 1.2579 1.0835 1.1295 1.1309 1.1468 1.1533 1.1487 1.1061 1.0878 1.0953 2.1177 2.0085 2.0572 3.2351 3.2380 3.9704 4.3481 3.7848 4.0005 4.4752 4.0506 4.0980 3.9826 3.9663 4.2997 3.5518 4.0542 3.9265 3.9563 3.9579 3.9536 3.8086 1.0045 1.0444 1.0761 1.0047 1.0002 0.9996 0.9836
dispcorr: -0.020722720 hartree
energy: -2806.536350759952
dipole: -52.29774 48.74730 -3.55044 5.32243 -5.41619 -0.09376 -1.87935 1.12845 -0.75090
magnitude: 3.63019 au
magnitude: 9.22721 debye
