program: Orca
programVersion: 5.0.2
elementType: Cl Cl F F F F F F F F F O O O N N C C C C C C C C C C C C C C C C C H H H H H H H
charge: 0
multiplicity: 1
keywords: wb97x-d3
keywords: def2-TZVPP
keywords: def2/J RIJCOSX
keywords: DEFGRID2
keywords: scfconv7
keywords: smallprint printgap noloewdin
keywords: NOSOSCF
formula: C17H7Cl2F9N2O3
InChI: InChI=1/C17H7Cl2F9N2O3/c18-5-4-8(29-15(32)30-13(31)9-6(20)2-1-3-7(9)21)11(22)10(19)12(5)33-17(27,28)14(23)16(24,25)26/h1-4,14,29-30H
40 atoms
Cl 2.137189 -2.175866 1.565217
Cl 2.323686 3.025652 0.179162
F  5.779713 -1.035726 1.150983
F  3.817994 -1.113625 -0.753274
F  4.100369 0.964381 -1.208459
F  6.777959 0.672662 -1.752943
F  6.417047 -1.441217 -1.556128
F  7.910994 -0.488666 -0.33868
F  -0.683375 -1.820582 1.146986
F  -6.558621 1.695137 1.078816
F  -6.188284 -2.215069 -1.455057
O  3.486938 0.385387 0.862611
O  -2.512849 2.311843 -0.707766
O  -4.27442 -1.215919 0.521506
N  -2.050152 0.317855 0.307884
N  -4.20289 0.865363 -0.399298
C  5.692794 -0.026571 0.227923
C  4.234175 0.051877 -0.228484
C  2.125211 0.3980 0.727436
C  -0.674079 0.424306 0.459493
C  6.704118 -0.33031 -0.880451
C  1.383684 -0.745394 1.006956
C  1.449458 1.55835 0.386536
C  0.011531 -0.716547 0.874053
C  0.071287 1.580975 0.25127
C  -2.858664 1.231013 -0.282511
C  -6.31497 -0.253234 -0.18944
C  -4.839105 -0.264787 0.020976
C  -7.1333 0.721186 0.366823
C  -6.943947 -1.266233 -0.902637
C  -8.504694 0.710265 0.230358
C  -8.30991 -1.308909 -1.082502
C  -9.083336 -0.312998 -0.504953
H  5.969594 0.924286 0.694296
H  -0.410902 2.504798 -0.019667
H  -2.488258 -0.558724 0.580182
H  -4.755239 1.57212 -0.870212
H  -9.104753 1.482755 0.69196
H  -8.757997 -2.104677 -1.662311
H  -10.157261 -0.335511 -0.629923
elementType: Cl F O N C H
totalener: -2806.52772066 hartree
nucrepener: 3858.92159420 hartree
electener: -6665.44931485 hartree
twoeener: 4889.31835587 hartree
cpcmener: -0.03159455 hartree
kineticenergy: 2798.64238764 hartree
xcener: -203.037090077585 hartree
chargesum: 0.0000000
charge: -0.031698 -0.052578 -0.203853 -0.176155 -0.176501 -0.161869 -0.161472 -0.162746 -0.198969 -0.206135 -0.199970 -0.306770 -0.476755 -0.438406 -0.170131 -0.153181 0.127908 0.446933 0.222834 0.042417 0.457917 -0.033365 -0.011517 0.251624 -0.130800 0.429250 -0.126319 0.401073 0.305512 0.301515 -0.238838 -0.240741 -0.063162 0.136246 0.145014 0.184753 0.195622 0.153550 0.152600 0.167161
qa: -0.0317 -0.0526 -0.2039 -0.1762 -0.1765 -0.1619 -0.1615 -0.1627 -0.1990 -0.2061 -0.2000 -0.3068 -0.4768 -0.4384 -0.1701 -0.1532 0.1279 0.4469 0.2228 0.0424 0.4579 -0.0334 -0.0115 0.2516 -0.1308 0.4292 -0.1263 0.4011 0.3055 0.3015 -0.2388 -0.2407 -0.0632 0.1362 0.1450 0.1848 0.1956 0.1536 0.1526 0.1672
va: 1.2778 1.2567 1.0806 1.1312 1.1344 1.1511 1.1519 1.1497 1.1079 1.0890 1.1001 2.1221 2.0345 2.0771 3.2312 3.2211 3.9706 4.3534 3.8266 3.9755 4.4788 4.0294 4.0806 3.9995 3.9743 4.3081 3.5462 4.0769 3.9316 3.9613 3.9623 3.9577 3.8134 1.0089 1.0439 1.0720 1.0069 1.0004 1.0010 0.9846
dispcorr: -0.020252238 hartree
energy: -2806.547972895831
dipole: -53.76219 50.15898 -3.60321 6.59274 -5.69225 0.90049 -0.00666 -0.08028 -0.08693
magnitude: 3.71505 au
magnitude: 9.44290 debye
