program: Orca
programVersion: 5.0.2
elementType: Cl Cl F F F F F F F F F O O O N N C C C C C C C C C C C C C C C C C H H H H H H H
charge: 0
multiplicity: 1
keywords: wb97x-d3
keywords: def2-TZVPP
keywords: def2/J RIJCOSX
keywords: DEFGRID2
keywords: scfconv7
keywords: smallprint printgap noloewdin
keywords: NOSOSCF
formula: C17H7Cl2F9N2O3
InChI: InChI=1/C17H7Cl2F9N2O3/c18-5-4-8(29-15(32)30-13(31)9-6(20)2-1-3-7(9)21)11(22)10(19)12(5)33-17(27,28)14(23)16(24,25)26/h1-4,14,29-30H
40 atoms
Cl 2.19158 0.377554 -2.852186
Cl 2.265321 1.406337 2.437022
F  5.779511 1.087102 1.15522
F  3.8351 -0.843156 1.154703
F  4.06935 -1.148202 -0.957122
F  6.743305 -1.728005 -0.710988
F  6.440185 -1.61534 1.418699
F  7.910265 -0.361685 0.475528
F  -0.648154 0.302434 -2.442709
F  -6.780355 1.999487 -0.830174
F  -6.039999 -2.055279 1.355766
O  3.467637 0.873877 -0.22122
O  -2.191281 -1.538492 -1.047057
O  -4.491809 1.302485 0.850407
N  -2.074694 0.508927 -0.074783
N  -4.118408 -0.580417 -0.375266
C  5.680426 0.220785 0.098356
C  4.222778 -0.236481 0.020545
C  2.106574 0.760653 -0.175108
C  -0.680123 0.592677 -0.112711
C  6.698939 -0.896885 0.327744
C  1.395271 0.516971 -1.34445
C  1.41275 0.975544 1.008656
C  0.013442 0.4601 -1.306617
C  0.033879 0.872913 1.042449
C  -2.728691 -0.587408 -0.523364
C  -6.36283 -0.013608 0.268479
C  -4.906214 0.309199 0.288973
C  -7.267001 0.895097 -0.26294
C  -6.888927 -1.168541 0.827958
C  -8.628088 0.683443 -0.250211
C  -8.243791 -1.422258 0.871318
C  -9.106329 -0.483775 0.326749
H  5.939146 0.739926 -0.830135
H  -0.499284 1.007565 1.974182
H  -2.588793 1.195225 0.468225
H  -4.566224 -1.37159 -0.822437
H  -9.297415 1.413258 -0.683617
H  -8.61563 -2.331263 1.323838
H  -10.171908 -0.665974 0.350397
elementType: Cl F O N C H
totalener: -2806.52575306 hartree
nucrepener: 3864.94384453 hartree
electener: -6671.46959758 hartree
twoeener: 4895.66902649 hartree
cpcmener: -0.03654450 hartree
kineticenergy: 2798.68325804 hartree
xcener: -203.040361733956 hartree
chargesum: 0.0000000
charge: -0.034260 -0.048627 -0.203224 -0.174578 -0.176319 -0.161457 -0.161307 -0.162666 -0.185885 -0.201657 -0.205992 -0.305183 -0.475353 -0.443165 -0.213239 -0.157709 0.124295 0.449494 0.236359 0.079951 0.458200 -0.011745 0.016064 0.209631 -0.159443 0.419395 -0.140881 0.408350 0.298304 0.316068 -0.240096 -0.244205 -0.064362 0.137393 0.138623 0.207324 0.199256 0.153107 0.152794 0.166745
qa: -0.0343 -0.0486 -0.2032 -0.1746 -0.1763 -0.1615 -0.1613 -0.1627 -0.1859 -0.2017 -0.2060 -0.3052 -0.4754 -0.4432 -0.2132 -0.1577 0.1243 0.4495 0.2364 0.0800 0.4582 -0.0117 0.0161 0.2096 -0.1594 0.4194 -0.1409 0.4083 0.2983 0.3161 -0.2401 -0.2442 -0.0644 0.1374 0.1386 0.2073 0.1993 0.1531 0.1528 0.1667
va: 1.2737 1.2614 1.0813 1.1331 1.1346 1.1520 1.1521 1.1500 1.1320 1.0980 1.0889 2.1223 2.0449 2.0673 3.1519 3.2099 3.9744 4.3489 3.8400 3.7195 4.4802 3.9812 4.0197 4.1679 4.1201 4.3355 3.5447 4.0831 3.9579 3.9325 3.9597 3.9618 3.8108 1.0085 1.0201 1.0347 1.0037 1.0005 1.0007 0.9847
dispcorr: -0.020442908 hartree
energy: -2806.546195965147
dipole: -53.80452 50.42911 -3.37541 1.70557 -1.34614 0.35943 1.63824 -1.67480 -0.03656
magnitude: 3.39469 au
magnitude: 8.62861 debye
