program: Orca
programVersion: 5.0.2
elementType: Cl Cl F F F F F F F F F O O O N N C C C C C C C C C C C C C C C C C H H H H H H H
charge: 0
multiplicity: 1
keywords: wb97x-d3
keywords: def2-TZVPP
keywords: def2/J RIJCOSX
keywords: DEFGRID2
keywords: scfconv7
keywords: smallprint printgap noloewdin
keywords: NOSOSCF
formula: C17H7Cl2F9N2O3
InChI: InChI=1/C17H7Cl2F9N2O3/c18-5-4-8(29-15(32)30-13(31)9-6(20)2-1-3-7(9)21)11(22)10(19)12(5)33-17(27,28)14(23)16(24,25)26/h1-4,14,29-30H
40 atoms
Cl 2.272679 -2.567642 1.386787
Cl 2.389976 2.495826 -0.448761
F  6.445205 -0.815655 -1.466247
F  3.947461 -1.731091 -1.029334
F  3.997931 0.279056 -1.740985
F  5.824284 1.297527 1.264859
F  6.05285 1.879245 -0.796064
F  7.64253 0.843915 0.207813
F  -0.548869 -2.299526 0.963052
F  -6.396498 1.155709 1.840849
F  -6.311244 -0.709152 -2.451939
O  3.572439 -0.07904 0.426714
O  -2.471603 -0.73031 2.174754
O  -4.193292 0.709759 -1.266204
N  -1.973556 -0.068388 0.06022
N  -4.183952 -0.308542 0.768159
C  5.771024 -0.443544 -0.330918
C  4.279157 -0.478584 -0.667854
C  2.208134 -0.072847 0.344054
C  -0.584264 -0.0687 0.212102
C  6.3178 0.921554 0.088746
C  1.486508 -1.190981 0.745457
C  1.52351 1.059939 -0.07647
C  0.104797 -1.19028 0.652246
C  0.142101 1.06263 -0.132984
C  -2.819299 -0.380497 1.068419
C  -6.284405 0.207916 -0.296847
C  -4.794394 0.236609 -0.322493
C  -7.039709 0.683498 0.768865
C  -6.993236 -0.240284 -1.408012
C  -8.41769 0.712781 0.755978
C  -8.370505 -0.250457 -1.457094
C  -9.075512 0.233566 -0.365691
H  5.971887 -1.16308 0.468983
H  -0.386609 1.949717 -0.454968
H  -2.361626 0.342597 -0.783499
H  -4.764717 -0.685734 1.506135
H  -8.962083 1.106949 1.603176
H  -8.880124 -0.629375 -2.332558
H  -10.156357 0.241623 -0.392593
elementType: Cl F O N C H
totalener: -2806.52571170 hartree
nucrepener: 3887.49549203 hartree
electener: -6694.02120373 hartree
twoeener: 4918.09435888 hartree
cpcmener: -0.03614580 hartree
kineticenergy: 2798.67196930 hartree
xcener: -203.039532628754 hartree
chargesum: 0.0000000
charge: -0.033690 -0.048973 -0.204577 -0.175292 -0.173455 -0.160110 -0.161723 -0.163565 -0.185064 -0.206414 -0.198588 -0.319247 -0.474335 -0.446769 -0.212956 -0.158589 0.135362 0.444357 0.253254 0.078576 0.458910 -0.017693 0.004855 0.225276 -0.163380 0.414795 -0.135914 0.411050 0.309896 0.292802 -0.238876 -0.232382 -0.064792 0.133073 0.139579 0.208609 0.192745 0.153431 0.152523 0.167293
qa: -0.0337 -0.0490 -0.2046 -0.1753 -0.1735 -0.1601 -0.1617 -0.1636 -0.1851 -0.2064 -0.1986 -0.3192 -0.4743 -0.4468 -0.2130 -0.1586 0.1354 0.4444 0.2533 0.0786 0.4589 -0.0177 0.0049 0.2253 -0.1634 0.4148 -0.1359 0.4110 0.3099 0.2928 -0.2389 -0.2324 -0.0648 0.1331 0.1396 0.2086 0.1927 0.1534 0.1525 0.1673
va: 1.2743 1.2597 1.0832 1.1310 1.1344 1.1515 1.1522 1.1489 1.1318 1.0882 1.1008 2.1131 2.0451 2.0607 3.1509 3.2167 3.9625 4.3775 3.7977 3.7181 4.4669 3.9954 4.0517 4.1578 4.1157 4.3440 3.5409 4.0829 3.9295 3.9633 3.9592 3.9511 3.8166 1.0098 1.0193 1.0337 1.0096 1.0007 1.0006 0.9847
dispcorr: -0.020777681 hartree
energy: -2806.546489385636
dipole: -53.17699 49.67920 -3.49779 1.27205 -1.26983 0.00221 1.37455 -1.29421 0.08033
magnitude: 3.49872 au
magnitude: 8.89303 debye
