program: Orca
programVersion: 5.0.2
elementType: Cl Cl F F F F F F F F F O O O N N C C C C C C C C C C C C C C C C C H H H H H H H
charge: 0
multiplicity: 1
keywords: wb97x-d3
keywords: def2-TZVPP
keywords: def2/J RIJCOSX
keywords: DEFGRID2
keywords: scfconv7
keywords: smallprint printgap noloewdin
keywords: NOSOSCF
formula: C17H7Cl2F9N2O3
InChI: InChI=1/C17H7Cl2F9N2O3/c18-5-4-8(29-15(32)30-13(31)9-6(20)2-1-3-7(9)21)11(22)10(19)12(5)33-17(27,28)14(23)16(24,25)26/h1-4,14,29-30H
40 atoms
Cl 2.297059 2.588273 1.13036
Cl 2.388537 -2.551541 -0.48709
F  6.005348 1.385174 0.415048
F  4.031313 -0.402166 -1.882396
F  3.927689 1.642899 -1.26695
F  7.653733 -0.848152 0.080306
F  5.982512 -1.927886 -0.741891
F  5.885456 -1.135874 1.262917
F  -0.543113 2.28287 0.8016
F  -6.358177 2.054684 0.371578
F  -6.295984 -2.431954 -0.925116
O  3.578462 0.056921 0.262675
O  -2.389071 0.546907 2.15784
O  -4.219467 -0.470588 -1.391659
N  -1.96817 0.042287 -0.014305
N  -4.149032 0.156684 0.798051
C  5.779906 0.418617 -0.52939
C  4.283838 0.41621 -0.846053
C  2.21396 0.05141 0.193751
C  -0.574424 0.039455 0.106067
C  6.322054 -0.897684 0.029777
C  1.499948 1.186165 0.561604
C  1.526233 -1.099856 -0.167691
C  0.117383 1.175064 0.499499
C  0.143971 -1.104721 -0.206966
C  -2.776946 0.267333 1.044236
C  -6.274967 -0.189938 -0.270762
C  -4.786916 -0.178187 -0.358677
C  -7.017254 0.933755 0.064292
C  -6.985474 -1.334709 -0.608842
C  -8.39603 0.940189 0.068915
C  -8.362716 -1.381453 -0.60329
C  -9.059746 -0.230426 -0.265411
H  6.325756 0.664753 -1.446038
H  -0.389891 -2.003714 -0.485036
H  -2.379053 -0.312629 -0.872249
H  -4.714992 0.314999 1.622784
H  -8.937289 1.841058 0.324842
H  -8.878637 -2.296981 -0.859584
H  -10.140985 -0.246626 -0.263409
elementType: Cl F O N C H
totalener: -2806.52616983 hartree
nucrepener: 3899.58697796 hartree
electener: -6706.11314779 hartree
twoeener: 4930.52186363 hartree
cpcmener: -0.03723186 hartree
kineticenergy: 2798.67639574 hartree
xcener: -203.039614088881 hartree
chargesum: -0.0000000
charge: -0.032558 -0.049273 -0.201733 -0.174437 -0.175754 -0.163993 -0.161431 -0.158736 -0.185616 -0.205825 -0.201426 -0.309825 -0.478275 -0.442397 -0.217569 -0.159647 0.121026 0.450009 0.249962 0.078777 0.459640 -0.015208 0.005617 0.225143 -0.165886 0.416416 -0.138465 0.410970 0.309748 0.301646 -0.241723 -0.240476 -0.064675 0.134821 0.140258 0.209024 0.199113 0.153057 0.152584 0.167114
qa: -0.0326 -0.0493 -0.2017 -0.1744 -0.1758 -0.1640 -0.1614 -0.1587 -0.1856 -0.2058 -0.2014 -0.3098 -0.4783 -0.4424 -0.2176 -0.1596 0.1210 0.4500 0.2500 0.0788 0.4596 -0.0152 0.0056 0.2251 -0.1659 0.4164 -0.1385 0.4110 0.3097 0.3016 -0.2417 -0.2405 -0.0647 0.1348 0.1403 0.2090 0.1991 0.1531 0.1526 0.1671
va: 1.2762 1.2592 1.0889 1.1335 1.1327 1.1478 1.1537 1.1531 1.1330 1.0893 1.0982 2.1230 2.0444 2.0677 3.1343 3.2081 3.9786 4.3503 3.8016 3.6945 4.4735 3.9909 4.0444 4.1770 4.1300 4.3478 3.5396 4.0786 3.9370 3.9557 3.9611 3.9581 3.8117 1.0053 1.0190 1.0345 1.0040 1.0007 1.0008 0.9847
dispcorr: -0.020964590 hartree
energy: -2806.547134419857
dipole: -52.48475 49.32995 -3.15481 -2.49962 1.92545 -0.57417 -0.97909 -0.06702 -1.04612
magnitude: 3.37296 au
magnitude: 8.57337 debye
