program: Orca
programVersion: 5.0.2
elementType: Cl F F F F F F F F O O O O N N C C C C C C C C C C C C C C C C C H H H H H H H H H
charge: 0
multiplicity: 1
keywords: wb97x-d3
keywords: def2-TZVPP
keywords: def2/J RIJCOSX
keywords: DEFGRID2
keywords: scfconv7
keywords: smallprint printgap noloewdin
keywords: NOSOSCF
formula: C17H9ClF8N2O4
InChI: InChI=1/C17H9ClF8N2O4/c18-8-6-7(4-5-11(8)31-16(22,23)14(21)32-17(24,25)26)27-15(30)28-13(29)12-9(19)2-1-3-10(12)20/h1-6,14,27-28H
41 atoms
Cl 2.822114 -1.622948 -2.093706
F  4.712122 2.313015 0.01974
F  6.066575 1.253413 -1.294496
F  6.015694 0.267005 1.180389
F  -5.983256 -1.295297 -1.864094
F  -5.217409 0.221534 2.480573
F  4.123057 -1.193416 2.880854
F  3.452593 -2.185777 1.102917
F  2.137726 -0.835519 2.137592
O  3.964909 1.026513 -1.651371
O  3.779928 0.023247 1.05137
O  -2.228778 2.645799 -0.10151
O  -3.426953 -1.303522 -0.357899
N  -1.466629 0.541517 -0.567452
N  -3.687785 0.934502 -0.010622
C  2.619548 0.960382 -1.348466
C  -0.114477 0.763263 -0.827623
C  4.891985 1.165825 -0.662852
C  1.954319 -0.244245 -1.531652
C  1.902142 2.069401 -0.943295
C  0.604393 -0.348083 -1.270523
C  0.545178 1.981075 -0.675487
C  4.974946 0.006192 0.341215
C  -5.559437 -0.532495 0.297786
C  -2.401974 1.449226 -0.227472
C  -4.122136 -0.353222 -0.050664
C  -6.444955 -1.051475 -0.635416
C  -6.059352 -0.263989 1.563044
C  -7.769939 -1.293179 -0.345576
C  -7.37453 -0.497848 1.904351
C  -8.222999 -1.013884 0.935972
C  3.391666 -1.046783 1.781833
H  2.391991 3.02716 -0.837031
H  0.104382 -1.298672 -1.409262
H  0.028749 2.868272 -0.351591
H  5.166676 -0.94019 -0.170145
H  -1.78762 -0.418942 -0.656618
H  -4.367867 1.648679 0.222414
H  -8.43195 -1.689087 -1.103394
H  -7.72594 -0.284911 2.90454
H  -9.258101 -1.202111 1.184281
elementType: Cl F O N C H
totalener: -2322.90213894 hartree
nucrepener: 3562.11255739 hartree
electener: -5885.01469633 hartree
twoeener: 4406.62245568 hartree
cpcmener: -0.03915511 hartree
kineticenergy: 2315.67073158 hartree
xcener: -181.042051114261 hartree
chargesum: 0.0000000
charge: -0.065232 -0.180191 -0.170523 -0.198934 -0.205226 -0.208249 -0.161121 -0.163629 -0.159221 -0.303703 -0.254352 -0.512490 -0.462430 -0.164980 -0.148439 0.121448 0.190273 0.478538 0.052986 -0.087269 -0.183449 -0.219668 0.174832 -0.128066 0.433174 0.406349 0.306975 0.316418 -0.248087 -0.247186 -0.063678 0.592744 0.149981 0.130088 0.159440 0.139673 0.202782 0.200465 0.155136 0.155112 0.169710
qa: -0.0652 -0.1802 -0.1705 -0.1989 -0.2052 -0.2082 -0.1611 -0.1636 -0.1592 -0.3037 -0.2544 -0.5125 -0.4624 -0.1650 -0.1484 0.1214 0.1903 0.4785 0.0530 -0.0873 -0.1834 -0.2197 0.1748 -0.1281 0.4332 0.4063 0.3070 0.3164 -0.2481 -0.2472 -0.0637 0.5927 0.1500 0.1301 0.1594 0.1397 0.2028 0.2005 0.1551 0.1551 0.1697
va: 1.2533 1.1221 1.1380 1.0876 1.0930 1.0864 1.1484 1.1437 1.1521 2.0871 2.0947 1.9938 2.0487 3.2550 3.2205 3.8538 3.8577 4.3578 3.9464 4.0114 4.0346 3.9976 4.1064 3.5485 4.3008 4.0656 3.9497 3.9312 3.9607 3.9612 3.8040 4.6141 1.0085 1.0273 1.0276 0.9959 1.0395 1.0029 1.0000 0.9998 0.9835
dispcorr: -0.021572656 hartree
energy: -2322.923711600642
dipole: -40.37052 36.79287 -3.57765 5.17275 -5.98499 -0.81224 -3.56436 3.87542 0.31106
magnitude: 3.68186 au
magnitude: 9.35855 debye
