program: Orca
programVersion: 5.0.2
elementType: Cl F F F F F F F F O O O O N N C C C C C C C C C C C C C C C C C H H H H H H H H H
charge: 0
multiplicity: 1
keywords: wb97x-d3
keywords: def2-TZVPP
keywords: def2/J RIJCOSX
keywords: DEFGRID2
keywords: scfconv7
keywords: smallprint printgap noloewdin
keywords: NOSOSCF
formula: C17H9ClF8N2O4
InChI: InChI=1/C17H9ClF8N2O4/c18-8-6-7(4-5-11(8)31-16(22,23)14(21)32-17(24,25)26)27-15(30)28-13(29)12-9(19)2-1-3-10(12)20/h1-6,14,27-28H
41 atoms
Cl 3.139807 -0.467187 -2.751028
F  4.553392 2.39782 0.990246
F  6.029019 1.898625 -0.50846
F  5.883409 0.084174 1.440733
F  -5.981653 -0.358221 -1.872938
F  -5.305484 -0.18672 2.750395
F  2.024623 -1.339132 1.752366
F  4.004116 -2.141358 2.027411
F  3.162497 -2.035703 0.062334
O  3.963065 1.765711 -1.073636
O  3.678018 -0.136617 1.108977
O  -1.612395 -1.576122 -1.54766
O  -3.727876 1.158332 0.722256
N  -1.423364 0.469455 -0.548532
N  -3.419032 -0.734048 -0.507941
C  2.621443 1.458108 -0.943206
C  -0.071165 0.755987 -0.742797
C  4.823184 1.5656 -0.036586
C  2.103443 0.412119 -1.689885
C  1.770897 2.198176 -0.139201
C  0.768475 0.051065 -1.601575
C  0.440824 1.845138 -0.035713
C  4.90042 0.126643 0.500526
C  -5.581879 -0.278206 0.429697
C  -2.079428 -0.651621 -0.910383
C  -4.163059 0.133489 0.232393
C  -6.451332 -0.500872 -0.629991
C  -6.112813 -0.394546 1.708906
C  -7.775948 -0.837425 -0.449244
C  -7.426486 -0.74088 1.939627
C  -8.252569 -0.959843 0.847022
C  3.234678 -1.405819 1.231521
H  2.137215 3.051719 0.413441
H  0.408045 -0.767894 -2.201185
H  -0.207764 2.422659 0.610685
H  5.150152 -0.571933 -0.301968
H  -1.938216 1.124826 0.032383
H  -3.86537 -1.589523 -0.815919
H  -8.420111 -0.995447 -1.30316
H  -7.793632 -0.838837 2.952056
H  -9.286906 -1.228976 1.009505
elementType: Cl F O N C H
totalener: -2322.90252791 hartree
nucrepener: 3583.05401373 hartree
electener: -5905.95654164 hartree
twoeener: 4427.78051780 hartree
cpcmener: -0.03995127 hartree
kineticenergy: 2315.64139391 hartree
xcener: -181.036781807703 hartree
chargesum: 0.0000000
charge: -0.066262 -0.181546 -0.170784 -0.197941 -0.207906 -0.203771 -0.158984 -0.161404 -0.165646 -0.298618 -0.252037 -0.514187 -0.465194 -0.167962 -0.150629 0.146152 0.173328 0.473172 0.019618 -0.093673 -0.175361 -0.201069 0.176394 -0.125141 0.436410 0.411430 0.309424 0.301194 -0.240615 -0.242210 -0.064485 0.598018 0.153830 0.137798 0.147357 0.139497 0.204711 0.197530 0.155264 0.154541 0.169754
qa: -0.0663 -0.1815 -0.1708 -0.1979 -0.2079 -0.2038 -0.1590 -0.1614 -0.1656 -0.2986 -0.2520 -0.5142 -0.4652 -0.1680 -0.1506 0.1462 0.1733 0.4732 0.0196 -0.0937 -0.1754 -0.2011 0.1764 -0.1251 0.4364 0.4114 0.3094 0.3012 -0.2406 -0.2422 -0.0645 0.5980 0.1538 0.1378 0.1474 0.1395 0.2047 0.1975 0.1553 0.1545 0.1698
va: 1.2511 1.1193 1.1375 1.0882 1.0869 1.0943 1.1531 1.1488 1.1399 2.0878 2.0964 1.9914 2.0436 3.2535 3.2219 3.8459 3.8686 4.3679 3.9663 3.9790 4.0356 3.9820 4.1011 3.5446 4.2988 4.0658 3.9272 3.9531 3.9565 3.9546 3.8088 4.6024 1.0057 1.0491 1.0052 0.9968 1.0342 1.0058 0.9998 1.0002 0.9836
dispcorr: -0.022036481 hartree
energy: -2322.924564388199
dipole: -39.86432 36.16621 -3.69811 2.77023 -3.25673 -0.48650 -2.10871 2.49325 0.38454
magnitude: 3.74974 au
magnitude: 9.53109 debye
