program: Orca
programVersion: 5.0.2
elementType: Cl F F F F F F F F O O O O N N C C C C C C C C C C C C C C C C C H H H H H H H H H
charge: 0
multiplicity: 1
keywords: wb97x-d3
keywords: def2-TZVPP
keywords: def2/J RIJCOSX
keywords: DEFGRID2
keywords: scfconv7
keywords: smallprint printgap noloewdin
keywords: NOSOSCF
formula: C17H9ClF8N2O4
InChI: InChI=1/C17H9ClF8N2O4/c18-8-6-7(4-5-11(8)31-16(22,23)14(21)32-17(24,25)26)27-15(30)28-13(29)12-9(19)2-1-3-10(12)20/h1-6,14,27-28H
41 atoms
Cl 1.888367 -1.819572 1.700081
F  4.098028 1.247244 -1.186534
F  3.548444 -0.815266 -0.90534
F  5.348693 -1.084426 1.117505
F  -6.322993 -2.215572 -1.069963
F  -6.863408 1.857281 1.137216
F  8.063729 -1.231718 -0.000829
F  7.988675 0.881324 -0.352033
F  7.987946 -0.4835 -2.015205
O  3.234468 0.621487 0.775257
O  6.196105 -0.356472 -0.839876
O  -2.812978 2.247723 -1.250783
O  -4.464497 -0.909336 0.846313
N  -2.294671 0.553754 0.193836
N  -4.48248 0.94312 -0.483448
C  1.866861 0.628776 0.569595
C  -0.904328 0.646124 0.273602
C  4.027637 0.265476 -0.26448
C  1.112455 -0.4604 0.984636
C  1.229923 1.723373 0.018212
C  -0.259921 -0.452862 0.842847
C  -0.148576 1.744648 -0.131285
C  5.430022 -0.020326 0.273962
C  -6.548677 -0.167177 0.021487
C  -3.12892 1.306659 -0.549561
C  -5.068757 -0.088829 0.181684
C  -7.131308 -1.271703 -0.58279
C  -7.404448 0.803619 0.518584
C  -8.495661 -1.412004 -0.713858
C  -8.776037 0.705827 0.4186
C  -9.31121 -0.410739 -0.206111
C  7.544072 -0.293521 -0.785931
H  1.806529 2.588828 -0.27972
H  -0.836978 -1.308958 1.169197
H  -0.607761 2.624169 -0.550448
H  5.819376 0.839522 0.824291
H  -2.715946 -0.236521 0.675135
H  -5.082724 1.533423 -1.046766
H  -8.910974 -2.28359 -1.20084
H  -9.410314 1.482558 0.823221
H  -10.384321 -0.504133 -0.297302
elementType: Cl F O N C H
totalener: -2322.90672232 hartree
nucrepener: 3372.75237620 hartree
electener: -5695.65909852 hartree
oneelecener: -9913.40939865 hartree
twoeener: 4217.75030013 hartree
cpcmener: -0.04168969 hartree
kineticenergy: 2315.65614331 hartree
xcener: -181.036864292565 hartree
chargesum: 0.0000000
charge: -0.062346 -0.185165 -0.179779 -0.197247 -0.205010 -0.208163 -0.164250 -0.165059 -0.158470 -0.318229 -0.254374 -0.511378 -0.460320 -0.173179 -0.149680 0.148663 0.196237 0.471317 0.061164 -0.119431 -0.184437 -0.224812 0.221403 -0.128598 0.433738 0.404792 0.306744 0.317134 -0.248831 -0.246932 -0.064213 0.579527 0.156483 0.130666 0.154787 0.141189 0.204940 0.200758 0.154595 0.155687 0.170080
qa: -0.0623 -0.1852 -0.1798 -0.1972 -0.2050 -0.2082 -0.1643 -0.1651 -0.1585 -0.3182 -0.2544 -0.5114 -0.4603 -0.1732 -0.1497 0.1487 0.1962 0.4713 0.0612 -0.1194 -0.1844 -0.2248 0.2214 -0.1286 0.4337 0.4048 0.3067 0.3171 -0.2488 -0.2469 -0.0642 0.5795 0.1565 0.1307 0.1548 0.1412 0.2049 0.2008 0.1546 0.1557 0.1701
va: 1.2558 1.1237 1.1230 1.0857 1.0932 1.0863 1.1401 1.1413 1.1518 2.0978 2.1228 1.9948 2.0498 3.2464 3.2184 3.8310 3.8345 4.3254 4.0107 4.0378 4.0427 4.0058 4.0899 3.5447 4.3022 4.0696 3.9523 3.9287 3.9612 3.9607 3.8047 4.6354 1.0021 1.0273 1.0264 0.9950 1.0382 1.0023 1.0001 0.9996 0.9834
dispcorr: -0.018952258 hartree
energy: -2322.925674578265
dipole: -53.08697 49.47208 -3.61489 8.62138 -7.69693 0.92445 0.85228 -0.64498 0.20730
magnitude: 3.73698 au
magnitude: 9.49864 debye
