program: Orca
programVersion: 5.0.2
elementType: Cl F F F F F F F F O O O O N N C C C C C C C C C C C C C C C C C H H H H H H H H H
charge: 0
multiplicity: 1
keywords: wb97x-d3
keywords: def2-TZVPP
keywords: def2/J RIJCOSX
keywords: DEFGRID2
keywords: scfconv7
keywords: smallprint printgap noloewdin
keywords: NOSOSCF
formula: C17H9ClF8N2O4
InChI: InChI=1/C17H9ClF8N2O4/c18-8-6-7(4-5-11(8)31-16(22,23)14(21)32-17(24,25)26)27-15(30)28-13(29)12-9(19)2-1-3-10(12)20/h1-6,14,27-28H
41 atoms
Cl 2.216375 1.980718 1.811177
F  3.558681 1.525642 -1.025352
F  3.919951 -0.423405 -1.865216
F  5.58486 1.128174 0.802676
F  -6.509105 -0.980135 -2.377472
F  -6.655631 0.295844 2.112699
F  8.063989 -0.421704 0.423843
F  7.618684 -1.001539 -1.592046
F  7.439552 -2.438578 -0.002361
O  3.335181 -0.268847 0.285581
O  5.953347 -0.889303 -0.118254
O  -2.704362 2.089701 0.775036
O  -4.469885 -1.466515 -0.373407
N  -2.220211 -0.064296 0.193294
N  -4.412072 0.722284 0.256942
C  1.95641 -0.194022 0.242446
C  -0.824654 -0.050122 0.240232
C  4.027474 0.299124 -0.731783
C  1.301753 0.817768 0.928129
C  1.215723 -1.14969 -0.42929
C  -0.081074 0.89544 0.942551
C  -0.163607 -1.07969 -0.43013
C  5.50252 0.410155 -0.348763
C  -6.530174 -0.338044 -0.132752
C  -3.045786 0.974462 0.431636
C  -5.043895 -0.431196 -0.092631
C  -7.219913 -0.663767 -1.293332
C  -7.292953 -0.000049 0.976451
C  -8.595492 -0.643868 -1.369603
C  -8.671214 0.017918 0.954078
C  -9.313387 -0.304296 -0.231794
C  7.258577 -1.171614 -0.323346
H  1.714356 -1.959641 -0.944144
H  -0.553927 1.683794 1.504497
H  -0.732662 -1.830626 -0.963048
H  6.061046 0.928071 -1.133545
H  -2.649227 -0.915558 -0.157727
H  -4.986262 1.540119 0.422031
H  -9.094473 -0.889494 -2.296948
H  -9.228213 0.27585 1.84436
H  -10.393568 -0.290881 -0.27063
elementType: Cl F O N C H
totalener: -2322.90753839 hartree
nucrepener: 3385.50553399 hartree
electener: -5708.41307238 hartree
oneelecener: -9939.20330101 hartree
twoeener: 4230.79022863 hartree
cpcmener: -0.04292669 hartree
kineticenergy: 2315.65805536 hartree
xcener: -181.037250102862 hartree
chargesum: 0.0000000
charge: -0.065981 -0.181245 -0.185945 -0.195683 -0.204309 -0.208010 -0.164323 -0.165221 -0.157101 -0.312929 -0.253665 -0.514003 -0.465055 -0.174587 -0.152411 0.166290 0.184647 0.478821 0.048231 -0.126033 -0.182608 -0.214117 0.212661 -0.127161 0.437145 0.413141 0.301316 0.312878 -0.242631 -0.242757 -0.066133 0.577281 0.157320 0.135752 0.148010 0.143202 0.205523 0.199298 0.154895 0.155186 0.170312
qa: -0.0660 -0.1812 -0.1859 -0.1957 -0.2043 -0.2080 -0.1643 -0.1652 -0.1571 -0.3129 -0.2537 -0.5140 -0.4651 -0.1746 -0.1524 0.1663 0.1846 0.4788 0.0482 -0.1260 -0.1826 -0.2141 0.2127 -0.1272 0.4371 0.4131 0.3013 0.3129 -0.2426 -0.2428 -0.0661 0.5773 0.1573 0.1358 0.1480 0.1432 0.2055 0.1993 0.1549 0.1552 0.1703
va: 1.2525 1.1238 1.1245 1.0887 1.0940 1.0868 1.1411 1.1406 1.1534 2.1057 2.1184 1.9903 2.0438 3.2433 3.2199 3.8177 3.8349 4.3162 4.0208 4.0266 4.0437 4.0002 4.0947 3.5433 4.3000 4.0669 3.9517 3.9290 3.9554 3.9576 3.8079 4.6373 1.0004 1.0463 1.0052 0.9934 1.0347 1.0045 0.9999 0.9998 0.9834
dispcorr: -0.019041462 hartree
energy: -2322.926579855742
dipole: -52.32644 48.77538 -3.55106 -1.88836 1.39028 -0.49807 -1.02620 -0.06153 -1.08773
magnitude: 3.74717 au
magnitude: 9.52455 debye
