program: Orca
programVersion: 5.0.2
elementType: Cl F F F F F F F F O O O O N N C C C C C C C C C C C C C C C C C H H H H H H H H H
charge: 0
multiplicity: 1
keywords: wb97x-d3
keywords: def2-TZVPP
keywords: def2/J RIJCOSX
keywords: DEFGRID2
keywords: scfconv7
keywords: smallprint printgap noloewdin
keywords: NOSOSCF
formula: C17H9ClF8N2O4
InChI: InChI=1/C17H9ClF8N2O4/c18-8-6-7(4-5-11(8)31-16(22,23)14(21)32-17(24,25)26)27-15(30)28-13(29)12-9(19)2-1-3-10(12)20/h1-6,14,27-28H
41 atoms
Cl 1.881964 -2.026635 1.582161
F  3.651465 0.611865 1.0019
F  3.968358 1.326091 -1.000467
F  5.801321 -0.738528 -1.423339
F  -6.882059 -0.553291 -2.036848
F  -6.361851 0.6982 2.438408
F  8.313988 0.059751 -0.255295
F  7.517992 -0.214201 1.715371
F  7.968787 1.766381 1.006212
O  3.228374 -0.760921 -0.708838
O  6.251032 0.782695 0.175539
O  -2.794301 1.432212 -2.123572
O  -4.495323 -0.835341 0.880007
N  -2.285241 -0.063392 -0.473296
N  -4.470653 0.652179 -0.843762
C  1.863866 -0.540564 -0.668825
C  -0.900534 -0.179324 -0.60341
C  4.028541 0.221411 -0.228698
C  1.110765 -1.0936 0.357987
C  1.227542 0.17369 -1.664758
C  -0.258227 -0.91755 0.392037
C  -0.145552 0.358376 -1.644817
C  5.461251 -0.308292 -0.178154
C  -6.562533 0.071576 0.195587
C  -3.116619 0.707131 -1.202615
C  -5.083855 -0.093595 0.115152
C  -7.416688 -0.189776 -0.867714
C  -7.156069 0.42441 1.402089
C  -8.788777 -0.110347 -0.757209
C  -8.521088 0.523954 1.558807
C  -9.33124 0.248949 0.466808
C  7.498416 0.584109 0.653978
H  1.800718 0.57957 -2.487157
H  -0.831656 -1.351843 1.20117
H  -0.59941 0.91567 -2.445827
H  5.539714 -1.145808 0.519555
H  -2.7102 -0.590171 0.284899
H  -5.048071 1.272452 -1.398816
H  -9.417603 -0.33081 -1.608699
H  -8.940672 0.81119 2.513027
H  -10.404893 0.317417 0.572156
elementType: Cl F O N C H
totalener: -2322.90710061 hartree
nucrepener: 3365.42180436 hartree
electener: -5688.32890498 hartree
oneelecener: -9898.50577184 hartree
twoeener: 4210.17686686 hartree
cpcmener: -0.04040001 hartree
kineticenergy: 2315.65706046 hartree
xcener: -181.037614980596 hartree
chargesum: -0.0000000
charge: -0.063326 -0.180399 -0.185178 -0.200092 -0.207631 -0.203858 -0.163995 -0.164595 -0.158201 -0.316671 -0.254784 -0.512889 -0.465427 -0.167066 -0.149452 0.156334 0.191120 0.464816 0.051819 -0.122421 -0.182019 -0.225756 0.233138 -0.129933 0.434078 0.413785 0.313064 0.300784 -0.242392 -0.240846 -0.065104 0.577817 0.155034 0.130823 0.159039 0.139226 0.204061 0.197390 0.155143 0.154673 0.169891
qa: -0.0633 -0.1804 -0.1852 -0.2001 -0.2076 -0.2039 -0.1640 -0.1646 -0.1582 -0.3167 -0.2548 -0.5129 -0.4654 -0.1671 -0.1495 0.1563 0.1911 0.4648 0.0518 -0.1224 -0.1820 -0.2258 0.2331 -0.1299 0.4341 0.4138 0.3131 0.3008 -0.2424 -0.2408 -0.0651 0.5778 0.1550 0.1308 0.1590 0.1392 0.2041 0.1974 0.1551 0.1547 0.1699
va: 1.2515 1.1248 1.1237 1.0823 1.0873 1.0943 1.1404 1.1421 1.1523 2.1000 2.1263 1.9922 2.0451 3.2550 3.2244 3.8297 3.8637 4.3472 4.0131 4.0350 4.0302 3.9949 4.0853 3.5483 4.3002 4.0630 3.9283 3.9510 3.9557 3.9542 3.8080 4.6399 1.0028 1.0269 1.0278 0.9971 1.0374 1.0059 0.9999 0.9999 0.9835
dispcorr: -0.018794887 hartree
energy: -2322.925895501678
dipole: -53.46758 49.58274 -3.88483 0.44234 -0.70998 -0.26764 -6.16952 6.53521 0.36569
magnitude: 3.91118 au
magnitude: 9.94142 debye
