program: Orca
programVersion: 5.0.2
elementType: Cl F F F F F F F F O O O O N N C C C C C C C C C C C C C C C C C H H H H H H H H H
charge: 0
multiplicity: 1
keywords: wb97x-d3
keywords: def2-TZVPP
keywords: def2/J RIJCOSX
keywords: DEFGRID2
keywords: scfconv7
keywords: smallprint printgap noloewdin
keywords: NOSOSCF
formula: C17H9ClF8N2O4
InChI: InChI=1/C17H9ClF8N2O4/c18-8-6-7(4-5-11(8)31-16(22,23)14(21)32-17(24,25)26)27-15(30)28-13(29)12-9(19)2-1-3-10(12)20/h1-6,14,27-28H
41 atoms
Cl 1.929529 -0.50869 2.665365
F  3.565941 1.682345 0.972477
F  3.950001 1.418499 -1.128541
F  5.609769 -0.042443 1.595504
F  -6.452953 1.782221 -1.468105
F  -6.705472 -1.643326 1.704643
F  8.075735 -0.668096 0.040939
F  7.658071 0.812672 -1.448051
F  7.40448 -1.271419 -1.910792
O  3.351749 -0.357842 0.090758
O  5.963501 -0.362987 -0.602066
O  -2.694564 -0.41068 -2.432798
O  -4.458238 0.059589 1.274722
N  -2.200626 -0.175246 -0.215433
N  -4.400316 -0.211263 -0.984743
C  1.975935 -0.282662 -0.021515
C  -0.805161 -0.22271 -0.227052
C  4.045703 0.805345 0.069524
C  1.188486 -0.353643 1.119471
C  1.366934 -0.192874 -1.257895
C  -0.188864 -0.330423 1.020494
C  -0.013166 -0.159646 -1.372711
C  5.520885 0.535665 0.367906
C  -6.517878 0.065189 0.120637
C  -3.030515 -0.27323 -1.27284
C  -5.032698 -0.019841 0.204769
C  -7.182575 0.977435 -0.689414
C  -7.309642 -0.74173 0.929961
C  -8.555773 1.098553 -0.704596
C  -8.685207 -0.666797 0.939342
C  -9.299834 0.265599 0.11669
C  7.264767 -0.361542 -0.965556
H  1.969824 -0.163228 -2.155029
H  -0.789574 -0.392202 1.919283
H  -0.44397 -0.077517 -2.355544
H  6.081814 1.47437 0.376497
H  -2.640178 -0.10873 0.69784
H  -4.97469 -0.318275 -1.81135
H  -9.031072 1.831295 -1.342019
H  -9.262172 -1.323471 1.575795
H  -10.377993 0.343365 0.115622
elementType: Cl F O N C H
totalener: -2322.90762630 hartree
nucrepener: 3379.95651886 hartree
electener: -5702.86414516 hartree
oneelecener: -9927.93829232 hartree
twoeener: 4225.07414716 hartree
cpcmener: -0.04164292 hartree
kineticenergy: 2315.64950905 hartree
xcener: -181.036488418992 hartree
chargesum: -0.0000000
charge: -0.063810 -0.182078 -0.186797 -0.196973 -0.207824 -0.203026 -0.163868 -0.165126 -0.157520 -0.312882 -0.252332 -0.513852 -0.467389 -0.167922 -0.149576 0.159121 0.186426 0.482356 0.047494 -0.127911 -0.182970 -0.217262 0.211803 -0.126913 0.435976 0.414373 0.308766 0.299019 -0.239959 -0.238359 -0.064817 0.576448 0.155827 0.131320 0.158992 0.143318 0.203033 0.194985 0.155807 0.154090 0.170009
qa: -0.0638 -0.1821 -0.1868 -0.1970 -0.2078 -0.2030 -0.1639 -0.1651 -0.1575 -0.3129 -0.2523 -0.5139 -0.4674 -0.1679 -0.1496 0.1591 0.1864 0.4824 0.0475 -0.1279 -0.1830 -0.2173 0.2118 -0.1269 0.4360 0.4144 0.3088 0.2990 -0.2400 -0.2384 -0.0648 0.5764 0.1558 0.1313 0.1590 0.1433 0.2030 0.1950 0.1558 0.1541 0.1700
va: 1.2523 1.1245 1.1232 1.0875 1.0871 1.0948 1.1415 1.1411 1.1528 2.1077 2.1199 1.9907 2.0418 3.2550 3.2242 3.8313 3.8592 4.3145 4.0109 4.0400 4.0307 3.9890 4.0932 3.5469 4.2996 4.0651 3.9282 3.9521 3.9554 3.9529 3.8103 4.6399 1.0033 1.0262 1.0263 0.9933 1.0371 1.0080 0.9995 1.0002 0.9836
dispcorr: -0.018923326 hartree
energy: -2322.926549622257
dipole: -51.65029 48.15684 -3.49344 -0.06535 0.79938 0.73403 -4.88353 4.45941 -0.42412
magnitude: 3.59483 au
magnitude: 9.13733 debye
