program: Orca
programVersion: 5.0.2
elementType: Cl F F F F F F F F O O O O N N C C C C C C C C C C C C C C C C C H H H H H H H H H
charge: 0
multiplicity: 1
keywords: wb97x-d3
keywords: def2-TZVPP
keywords: def2/J RIJCOSX
keywords: DEFGRID2
keywords: scfconv7
keywords: smallprint printgap noloewdin
keywords: NOSOSCF
formula: C17H9ClF8N2O4
InChI: InChI=1/C17H9ClF8N2O4/c18-8-6-7(4-5-11(8)31-16(22,23)14(21)32-17(24,25)26)27-15(30)28-13(29)12-9(19)2-1-3-10(12)20/h1-6,14,27-28H
41 atoms
Cl 2.267799 -1.668374 1.027745
F  3.611072 1.337301 1.076095
F  4.036941 2.395925 -0.747568
F  6.267144 1.719898 0.566447
F  -6.730601 -0.204138 -2.103158
F  -6.107615 -0.180983 2.521759
F  7.803883 -0.806746 0.541259
F  6.508815 -1.863115 -0.801007
F  6.440384 -2.289099 1.305851
O  3.420588 0.25287 -0.867915
O  5.609577 -0.424379 0.64206
O  -2.80544 2.162671 -1.581689
O  -4.221231 -1.1068 0.516342
N  -2.13037 0.239157 -0.548331
N  -4.371885 0.859265 -0.627532
C  2.040252 0.298704 -0.801659
C  -0.743352 0.313999 -0.683567
C  4.110396 1.182146 -0.163032
C  1.372488 -0.569763 0.050629
C  1.312209 1.152196 -1.60652
C  -0.006481 -0.566039 0.110493
C  -0.072527 1.166454 -1.558463
C  5.57733 0.753735 -0.099149
C  -6.369804 -0.182868 0.204518
C  -3.040335 1.143575 -0.962574
C  -4.888076 -0.204377 0.046039
C  -7.246066 -0.203942 -0.870456
C  -6.932167 -0.21074 1.473599
C  -8.614937 -0.248118 -0.7124
C  -8.29356 -0.241965 1.683624
C  -9.128713 -0.263835 0.575666
C  6.585444 -1.326818 0.414317
H  1.822378 1.806051 -2.300845
H  -0.515591 -1.242297 0.785501
H  -0.602814 1.837562 -2.212525
H  5.99145 0.65047 -1.105518
H  -2.486141 -0.535627 0.004914
H  -5.016679 1.578577 -0.933015
H  -9.263174 -0.27367 -1.577506
H  -8.691155 -0.249177 2.689236
H  -10.199771 -0.294229 0.718989
elementType: Cl F O N C H
totalener: -2322.90745374 hartree
nucrepener: 3415.43383065 hartree
electener: -5738.34128439 hartree
oneelecener: -9998.82700870 hartree
twoeener: 4260.48572431 hartree
cpcmener: -0.04169526 hartree
kineticenergy: 2315.65633643 hartree
xcener: -181.037354703778 hartree
chargesum: 0.0000000
charge: -0.063650 -0.179056 -0.186406 -0.199202 -0.208010 -0.204417 -0.165501 -0.166419 -0.158808 -0.316559 -0.250932 -0.512181 -0.462446 -0.173089 -0.150914 0.147813 0.194851 0.459584 0.067338 -0.115267 -0.191186 -0.225268 0.225204 -0.129703 0.434666 0.409701 0.316734 0.300812 -0.244481 -0.242682 -0.064870 0.579883 0.155428 0.132198 0.156047 0.146269 0.205615 0.199559 0.154971 0.154615 0.169756
qa: -0.0636 -0.1791 -0.1864 -0.1992 -0.2080 -0.2044 -0.1655 -0.1664 -0.1588 -0.3166 -0.2509 -0.5122 -0.4624 -0.1731 -0.1509 0.1478 0.1949 0.4596 0.0673 -0.1153 -0.1912 -0.2253 0.2252 -0.1297 0.4347 0.4097 0.3167 0.3008 -0.2445 -0.2427 -0.0649 0.5799 0.1554 0.1322 0.1560 0.1463 0.2056 0.1996 0.1550 0.1546 0.1698
va: 1.2535 1.1232 1.1222 1.0839 1.0867 1.0937 1.1402 1.1380 1.1503 2.0929 2.1132 1.9931 2.0479 3.2475 3.2197 3.8178 3.8373 4.3527 4.0089 4.0389 4.0455 4.0043 4.0732 3.5469 4.3008 4.0685 3.9261 3.9531 3.9567 3.9588 3.8074 4.6344 1.0027 1.0261 1.0264 0.9944 1.0367 1.0040 0.9999 0.9999 0.9837
dispcorr: -0.019427127 hartree
energy: -2322.926880865828
dipole: -50.44997 46.86153 -3.58844 5.23227 -5.21872 0.01355 -7.27648 6.48924 -0.78723
magnitude: 3.67381 au
magnitude: 9.33807 debye
