program: Orca
programVersion: 5.0.2
elementType: Cl F F F F F F F F O O O O N N C C C C C C C C C C C C C C C C C H H H H H H H H H
charge: 0
multiplicity: 1
keywords: wb97x-d3
keywords: def2-TZVPP
keywords: def2/J RIJCOSX
keywords: DEFGRID2
keywords: scfconv7
keywords: smallprint printgap noloewdin
keywords: NOSOSCF
formula: C17H9ClF8N2O4
InChI: InChI=1/C17H9ClF8N2O4/c18-8-6-7(4-5-11(8)31-16(22,23)14(21)32-17(24,25)26)27-15(30)28-13(29)12-9(19)2-1-3-10(12)20/h1-6,14,27-28H
41 atoms
Cl 2.046052 0.5881 2.85776
F  4.088099 0.479867 -1.803701
F  3.760923 -1.37878 -0.753164
F  5.486717 -0.617739 1.220678
F  -6.593881 -2.306261 -1.132759
F  -6.720931 2.125483 0.312618
F  8.218851 -0.880199 -1.872801
F  8.285248 -0.503391 0.244482
F  7.812376 1.088201 -1.110907
O  3.212673 0.538468 0.250308
O  6.349503 -0.57629 -0.856918
O  -2.944392 0.203012 2.386545
O  -4.492304 -0.177824 -1.432238
N  -2.327239 0.019591 0.194046
N  -4.56554 0.021171 0.837347
C  1.852652 0.337063 0.18349
C  -0.936005 0.113444 0.268463
C  4.079015 -0.084574 -0.577091
C  1.167218 0.381247 1.388894
C  1.13205 0.163121 -0.987854
C  -0.213389 0.280462 1.446433
C  -0.243542 0.046374 -0.940496
C  5.477826 0.046513 0.033548
C  -6.616481 -0.094421 -0.397149
C  -3.213727 0.090168 1.205753
C  -5.124445 -0.081611 -0.397686
C  -7.307069 -1.226335 -0.803763
C  -7.370738 1.017017 -0.054701
C  -8.683158 -1.276325 -0.855752
C  -8.748912 1.020617 -0.100591
C  -9.395515 -0.139312 -0.501201
C  7.65044 -0.211743 -0.88678
H  1.614781 0.136152 -1.954082
H  -0.697515 0.331351 2.406992
H  -0.785876 -0.084142 -1.868651
H  5.719645 1.097014 0.213167
H  -2.715941 -0.08174 -0.739111
H  -5.1934 0.061356 1.631777
H  -9.186547 -2.181538 -1.166518
H  -9.303128 1.909337 0.168624
H  -10.47569 -0.157614 -0.53974
elementType: Cl F O N C H
totalener: -2322.90566163 hartree
nucrepener: 3346.90605815 hartree
electener: -5669.81171978 hartree
oneelecener: -9861.41748140 hartree
twoeener: 4191.60576162 hartree
cpcmener: -0.04082509 hartree
kineticenergy: 2315.62626565 hartree
xcener: -181.033443300973 hartree
chargesum: 0.0000000
charge: -0.069148 -0.186982 -0.182165 -0.198486 -0.205615 -0.208133 -0.157199 -0.164133 -0.164761 -0.297104 -0.254363 -0.515160 -0.461742 -0.163382 -0.147404 0.179506 0.165634 0.487720 0.026275 -0.124515 -0.167172 -0.218386 0.212381 -0.127119 0.433436 0.401756 0.308020 0.319712 -0.249442 -0.248419 -0.066348 0.579797 0.149411 0.138829 0.148081 0.141555 0.203821 0.200706 0.155052 0.155203 0.170283
qa: -0.0691 -0.1870 -0.1822 -0.1985 -0.2056 -0.2081 -0.1572 -0.1641 -0.1648 -0.2971 -0.2544 -0.5152 -0.4617 -0.1634 -0.1474 0.1795 0.1656 0.4877 0.0263 -0.1245 -0.1672 -0.2184 0.2124 -0.1271 0.4334 0.4018 0.3080 0.3197 -0.2494 -0.2484 -0.0663 0.5798 0.1494 0.1388 0.1481 0.1416 0.2038 0.2007 0.1551 0.1552 0.1703
va: 1.2470 1.1185 1.1272 1.0843 1.0926 1.0860 1.1534 1.1410 1.1412 2.1331 2.1196 1.9916 2.0482 3.2582 3.2208 3.8515 3.9200 4.3100 4.0083 3.9950 4.0058 3.9947 4.1076 3.5466 4.2976 4.0696 3.9530 3.9303 3.9616 3.9612 3.8038 4.6346 1.0175 1.0534 1.0060 0.9962 1.0361 1.0025 0.9998 0.9997 0.9833
dispcorr: -0.018725564 hartree
energy: -2322.924387198825
dipole: -54.40650 50.76201 -3.64449 2.01820 -1.39385 0.62435 -1.02098 0.09148 -0.92950
magnitude: 3.81262 au
magnitude: 9.69091 debye
