program: Gaussian 09
title: 000055157
version: EM64L-G09RevD.01
frameworkgroup: C1[X(C10H7Cl2NO2)]
method: RPBEPBE
basis: SDD
operation: Freq
keyword: #p
keyword: freq=noraman
keyword: PBEPBE/SDD
title: #p freq=noraman PBEPBE/SDD
converged: YES YES NO NO
title: Mulliken charges:
elementType: Cl Cl O O N C C C C C C C C C C H H H H H H H
charge: -0.012064 -0.044980 -0.241040 -0.266682 -0.638477 0.411648 0.290559 0.224107 -0.424329 -0.404874 -0.375628 -0.281667 -0.123379 -0.225141 0.141281 0.237348 0.220784 0.296298 0.271184 0.283874 0.343458 0.317718
chargesum: 0.00000
title: Mulliken charges with hydrogens summed into heavy atoms:
elementType: Cl Cl O O N C C C C C C C C C C
charge: -0.012064 -0.044980 -0.241040 -0.266682 0.022700 0.411648 0.290559 0.224107 0.033802 -0.108576 -0.104444 -0.281667 -0.123379 0.058733 0.141281
polarizability: 2.37844148e+02 1.06031114e+01 1.61521038e+02 1.73010463e+00 2.83473850e+00 5.74310145e+01
1716.lowfreq: -5.4916 -0.0021 -0.0021 -0.0014 5.0214 6.7075 41.3041 52.2662 88.3760
frequency: 41.2955 52.2573 88.3645 113.7179 141.5346 160.6568 165.2056 218.2471 243.0004 292.7432 338.4739 359.6419 386.6710 398.8635 417.5503 455.2330 497.9998 524.2399 554.5125 557.9602 569.8804 597.3167 662.2692 666.7595 714.2779 743.9082 797.0572 859.8009 868.3374 879.0072 933.9615 948.7637 956.0860 999.9537 1047.1480 1068.5219 1102.6761 1179.3351 1205.5351 1222.7097 1241.5451 1312.5181 1345.2557 1368.2871 1381.8024 1413.3733 1438.4132 1471.4280 1551.1904 1569.1430 1597.6242 1625.3316 1657.0974 2946.1124 3051.9741 3146.3085 3165.6920 3183.4725 3523.2291 3675.1799
redmass: 5.6776 5.6844 3.6444 9.7904 5.2076 6.7654 20.9570 7.5010 4.3011 8.1129 7.3185 9.1434 11.5921 2.8908 5.2717 1.3233 3.6862 4.4480 5.0278 4.1468 4.3945 1.3035 6.8820 5.3103 4.4833 5.6980 7.9855 1.4424 2.5127 1.8498 7.0529 7.5308 1.5536 1.7746 1.9398 2.5592 1.7983 3.1563 1.5796 1.1970 2.1135 1.9752 3.3374 2.5912 3.3229 4.8916 3.0372 1.1322 7.6562 3.2665 8.4112 1.6410 5.7554 1.0677 1.0951 1.0925 1.0931 1.0935 1.0452 1.1038
irintensity: 16.2456 0.2777 1.8956 3.8847 5.2638 0.4508 0.3066 6.8568 0.8396 2.7931 1.4959 0.2742 3.1126 1.3749 7.3309 124.5623 20.0698 6.8629 26.5317 15.8915 14.9296 110.1074 39.6547 3.5125 64.4541 3.7128 33.9222 25.4070 7.1825 10.0197 35.9116 13.8504 22.8141 8.2369 9.8264 3.3303 0.7055 129.4609 26.7247 22.3236 54.1123 12.9316 323.8914 21.8499 18.7077 11.2200 106.8832 9.9667 51.9500 235.4236 8.2334 129.1477 147.9697 65.4562 25.2493 0.2538 0.0725 2.1169 59.3528 31.8203
temp: 298.150 k
press: 1.00000 atm
elementType: 17 17 8 8 7 6 6 6 6 6 6 6 6 6 6 1 1 1 1 1 1 1
symmnumber: 1
zpe: 392952.0 jmol-1
zpe.correction: 0.149668 hartree
zpe.thermalcorrener: 0.163173 hartree
zpe.thermalcorrenthalpy: 0.164117 hartree
zpe.thermalcorrgfe: 0.108120 hartree
zpe.sumelectzpe: -1509.514787 hartree
zpe.sumelectthermal: -1509.501282 hartree
zpe.sumelectthermalent: -1509.500338 hartree
zpe.sumelectthermalfe: -1509.556335 hartree
dipole: 2.6464 2.4116 1.1982
dipole: 3.7756
quadrupole: -88.4409 -107.8825 -102.2419
quadrupole: 15.6641 3.8048 0.9549
quadrupole: 11.0809 -8.3607 -2.7201 15.6641 3.8048 0.9549
hfenergy: -1509.6644549 hartree
pointgroup: C01 [X(C10H7Cl2N1O2)]
dipole: 0.9751544 -1.0182708 -0.4676196 debye
dipolederiv: -0.1449195 -0.1669336 0.0166961 -0.2334075 -0.6851608 0.0564859 0.0213729 0.0436903 -0.0401314 -0.5611915 0.35164 -0.0058338 0.406414 -0.4407717 0.0099364 -0.0145984 0.0177614 -0.0585776 -0.9322663 0.4095517 0.0708397 0.3998218 -0.5203619 -0.054326 -0.0404981 0.035019 -0.264328 -0.9215856 -0.1981847 -0.010048 -0.3221672 -0.9392864 -0.0724927 -0.0181261 -0.0625642 -0.3707686 -1.0721236 0.4821977 0.0721541 0.5047882 -0.6020466 -0.0064874 0.1002471 -0.0138971 -0.7040729 -0.2881853 -0.1361387 0.0399876 0.0802352 -0.0080522 -0.0149471 -0.0100055 0.0286296 -0.0123002 0.441697 -0.5128544 0.0507508 -0.5849036 0.1397023 0.0636343 0.1288275 -0.0095969 0.0902079 -1.1114337 -0.0097827 0.0682093 0.0556365 -0.0283504 0.01082 -0.0499906 0.0142387 -0.0902975 0.581351 -0.1511393 -0.1101951 -0.0300296 0.2216288 0.0245863 -0.0511801 0.0589066 0.4511077 0.5981392 0.0656379 -0.0359897 -0.0504674 0.0142744 0.0170003 0.0331974 0.0039573 -0.0892434 0.0123408 0.220933 -0.0316007 0.0149551 -0.1068107 0.0058588 -0.058294 -0.0048297 -0.1032006 0.1512247 0.4342674 -0.0502579 0.4288268 1.0357706 -0.1073785 -0.0579651 -0.115609 -0.0760125 0.6556604 -0.5914736 0.0284001 -0.8452926 0.5445498 -0.0056669 0.0440806 -0.0364767 -0.0775943 -0.3161835 0.0329864 0.015822 0.1934201 -0.2683557 -0.0000592 0.0019249 0.0221117 -0.0584741 2.1947241 -0.1962776 -0.0816021 -0.0009928 1.2081584 0.1360981 -0.0870382 0.1153399 0.2660449 0.0466996 0.0000997 -0.006871 0.0284678 0.0319085 -0.0366209 0.1044506 -0.114187 -0.1441358 -0.0817277 0.1117983 -0.0341507 0.1014395 0.0096675 0.0333556 -0.0508356 0.0547304 0.0470965 0.1118286 -0.0068195 -0.0037797 -0.0282717 0.0223375 -0.0156436 0.005754 -0.0119588 0.152955 0.0954729 -0.045633 0.0020812 -0.0242696 -0.0024473 0.0082069 0.0136046 0.0092247 0.1642927 0.0386056 -0.0254078 0.0046583 -0.0187971 0.1024154 0.0034855 0.0058638 0.0071861 0.1691796 0.2392099 -0.0195443 -0.0002649 -0.004318 0.1680566 -0.0285033 -0.0062927 -0.0239763 0.3792402 0.2626629 -0.048923 0.0009943 -0.071088 0.1031739 -0.0273425 -0.014499 -0.0176998 0.3690122 unknown
polarizability: 236.2607973|-14.6187783|162.9208765|-6.8799222|-0.3330203|57.6145266 unknown
InChI: InChI=1S/C10H7Cl2NO2/c11-7-2-5-1-6(10(13)14)4-15-9(5)8(12)3-7/h1-3H,4,13H2
charge 0 multiplicity 1
22 atoms
Cl -2.449956 -2.939703 0.252922
Cl -4.093399 2.357939 -0.054169
O  0.304052 -1.756416 0.127041
O  3.775347 1.732871 0.03708
N  4.434311 -0.467332 -0.259435
C  -0.37101 0.609222 -0.03654
C  -0.689369 -0.782453 0.038247
C  2.029735 0.053562 -0.14185
C  1.652988 -1.397962 -0.391485
C  1.038592 0.987323 -0.014449
C  -1.415571 1.56771 -0.061957
C  -2.04079 -1.181856 0.115263
C  -2.749074 1.131951 -0.009447
C  -3.083824 -0.234298 0.08556
C  3.459096 0.511168 -0.107727
H  1.668925 -1.632945 -1.477637
H  2.313626 -2.108252 0.135194
H  1.324971 2.036331 0.122149
H  -1.176236 2.633845 -0.116812
H  -4.125728 -0.56002 0.132512
H  5.407581 -0.163428 -0.243989
H  4.234331 -1.459359 -0.367471
