program: Orca
programVersion: 5.0.2
elementType: Cl F F F F F F F F O O O O N N C C C C C C C C C C C C C C C C C H H H H H H H H H
charge: 0
multiplicity: 1
keywords: wb97x-d3
keywords: def2-TZVPP
keywords: def2/J RIJCOSX
keywords: DEFGRID2
keywords: scfconv7
keywords: smallprint printgap noloewdin
keywords: NOSOSCF
formula: C17H9ClF8N2O4
InChI: InChI=1/C17H9ClF8N2O4/c18-8-6-7(4-5-11(8)31-16(22,23)14(21)32-17(24,25)26)27-15(30)28-13(29)12-9(19)2-1-3-10(12)20/h1-6,14,27-28H
41 atoms
Cl 2.495152 -1.369413 -1.635371
F  3.75551 0.292429 1.914459
F  4.150124 2.341329 1.381722
F  6.455518 1.103989 1.474394
F  -6.281401 -2.249844 0.441938
F  -6.719442 2.395988 0.234537
F  6.052327 -1.033645 -1.767673
F  6.38808 -2.55626 -0.287529
F  7.698609 -0.851701 -0.405358
O  3.380707 0.951006 -0.184157
O  5.623447 -0.667077 0.384505
O  -2.533154 -1.053095 -1.843335
O  -4.437104 0.882339 1.279934
N  -2.123193 0.189909 0.027036
N  -4.292756 -0.354293 -0.62917
C  2.023609 0.755496 -0.05341
C  -0.733945 0.326313 -0.040981
C  4.169424 1.079281 0.908624
C  1.466852 -0.30627 -0.749234
C  1.194368 1.59337 0.673895
C  0.098997 -0.527334 -0.75839
C  -0.169471 1.375628 0.682872
C  5.599668 0.72171 0.490542
C  -6.447164 0.077802 0.332459
C  -2.914181 -0.438835 -0.864963
C  -4.967152 0.245255 0.389797
C  -7.060377 -1.166485 0.37822
C  -7.281806 1.187149 0.292179
C  -8.430012 -1.322505 0.38025
C  -8.655813 1.081911 0.278408
C  -9.220502 -0.184568 0.325722
C  6.436546 -1.257043 -0.515234
H  1.590876 2.43877 1.218093
H  -0.288905 -1.371015 -1.304609
H  -0.805446 2.044117 1.249113
H  5.869575 1.242725 -0.432637
H  -2.59046 0.724359 0.753711
H  -4.840138 -0.820983 -1.34224
H  -8.866599 -2.310725 0.425774
H  -9.270782 1.96999 0.230116
H  -10.296811 -0.28587 0.320294
elementType: Cl F O N C H
totalener: -2322.90588446 hartree
nucrepener: 3414.44492280 hartree
electener: -5737.35080726 hartree
oneelecener: -9996.78906964 hartree
twoeener: 4259.43826238 hartree
cpcmener: -0.04168037 hartree
kineticenergy: 2315.65369248 hartree
xcener: -181.037353480895 hartree
chargesum: 0.0000000
charge: -0.071317 -0.181143 -0.185977 -0.198793 -0.207891 -0.204180 -0.165598 -0.158585 -0.165021 -0.308474 -0.256554 -0.515296 -0.464697 -0.178012 -0.152249 0.170331 0.176411 0.473945 0.044709 -0.115286 -0.181689 -0.207365 0.220113 -0.127215 0.436623 0.411478 0.312805 0.301392 -0.242827 -0.243636 -0.065267 0.582500 0.153786 0.135548 0.147943 0.144819 0.205957 0.199070 0.155099 0.154562 0.169983
qa: -0.0713 -0.1811 -0.1860 -0.1988 -0.2079 -0.2042 -0.1656 -0.1586 -0.1650 -0.3085 -0.2566 -0.5153 -0.4647 -0.1780 -0.1522 0.1703 0.1764 0.4739 0.0447 -0.1153 -0.1817 -0.2074 0.2201 -0.1272 0.4366 0.4115 0.3128 0.3014 -0.2428 -0.2436 -0.0653 0.5825 0.1538 0.1355 0.1479 0.1448 0.2060 0.1991 0.1551 0.1546 0.1700
va: 1.2472 1.1236 1.1200 1.0845 1.0868 1.0942 1.1381 1.1510 1.1412 2.1147 2.1090 1.9899 2.0435 3.2426 3.2175 3.8108 3.8430 4.3281 4.0298 4.0120 4.0594 4.0056 4.0976 3.5454 4.3018 4.0692 3.9297 3.9534 3.9599 3.9539 3.8072 4.6326 1.0106 1.0443 1.0059 0.9950 1.0337 1.0044 0.9998 1.0000 0.9836
dispcorr: -0.019569114 hartree
energy: -2322.925453573145
dipole: -50.95360 47.24199 -3.71161 5.75408 -4.85182 0.90226 0.47336 -0.53684 -0.06348
magnitude: 3.82023 au
magnitude: 9.71025 debye
