program: Orca
programVersion: 5.0.2
elementType: Cl F F F F F F F F O O O O N N C C C C C C C C C C C C C C C C C H H H H H H H H H
charge: 0
multiplicity: 1
keywords: wb97x-d3
keywords: def2-TZVPP
keywords: def2/J RIJCOSX
keywords: DEFGRID2
keywords: scfconv7
keywords: smallprint printgap noloewdin
keywords: NOSOSCF
formula: C17H9ClF8N2O4
InChI: InChI=1/C17H9ClF8N2O4/c18-8-6-7(4-5-11(8)31-16(22,23)14(21)32-17(24,25)26)27-15(30)28-13(29)12-9(19)2-1-3-10(12)20/h1-6,14,27-28H
41 atoms
Cl 3.036119 1.427053 2.521783
F  5.865299 1.179689 0.398959
F  5.549331 1.776204 -1.644358
F  5.642998 -0.861426 -1.30118
F  -5.060539 -1.97342 -2.221192
F  -6.093284 0.841762 1.356583
F  3.609053 -2.87339 -0.354839
F  2.039769 -1.436851 -0.597653
F  2.681162 -1.995008 1.378252
O  3.961924 2.09577 -0.17158
O  4.001856 -0.760676 0.222595
O  -1.661701 -0.287125 2.082868
O  -3.675569 0.50007 -1.439532
N  -1.414101 0.701729 0.038024
N  -3.419162 -0.294029 0.680342
C  2.630687 1.736993 -0.11839
C  -0.064226 1.055116 0.055421
C  4.936776 1.238592 -0.573012
C  2.059205 1.421339 1.10481
C  1.836922 1.762231 -1.251363
C  0.720539 1.083488 1.206345
C  0.502085 1.417489 -1.167486
C  4.514114 -0.193039 -0.939141
C  -5.531498 -0.553404 -0.429303
C  -2.095327 0.04016 0.994967
C  -4.12735 -0.054871 -0.45587
C  -5.96081 -1.485547 -1.364294
C  -6.480813 -0.06947 0.459097
C  -7.26202 -1.935495 -1.418986
C  -7.797457 -0.477475 0.434096
C  -8.176201 -1.417822 -0.512251
C  3.092452 -1.757202 0.147167
H  2.267927 2.035152 -2.206025
H  0.313832 0.847227 2.17541
H  -0.103904 1.41989 -2.064683
H  3.818531 -0.20784 -1.78197
H  -1.902996 0.855324 -0.839211
H  -3.883941 -0.799786 1.425226
H  -7.55471 -2.673573 -2.153008
H  -8.510263 -0.067105 1.136258
H  -9.203113 -1.754092 -0.544587
elementType: Cl F O N C H
totalener: -2322.90145572 hartree
nucrepener: 3605.14397315 hartree
electener: -5928.04542887 hartree
twoeener: 4449.68797870 hartree
cpcmener: -0.04558879 hartree
kineticenergy: 2315.65844110 hartree
xcener: -181.041503450100 hartree
chargesum: 0.0000000
charge: -0.063593 -0.176750 -0.183214 -0.195857 -0.204892 -0.208049 -0.160455 -0.161480 -0.158039 -0.293636 -0.254900 -0.514043 -0.462862 -0.170140 -0.149586 0.146252 0.192567 0.447146 0.044082 -0.134419 -0.185555 -0.198883 0.179958 -0.132205 0.436373 0.410967 0.303197 0.318484 -0.245312 -0.245861 -0.064870 0.595330 0.166661 0.134290 0.148094 0.155540 0.205620 0.199812 0.154706 0.155343 0.170179
qa: -0.0636 -0.1767 -0.1832 -0.1959 -0.2049 -0.2080 -0.1605 -0.1615 -0.1580 -0.2936 -0.2549 -0.5140 -0.4629 -0.1701 -0.1496 0.1463 0.1926 0.4471 0.0441 -0.1344 -0.1856 -0.1989 0.1800 -0.1322 0.4364 0.4110 0.3032 0.3185 -0.2453 -0.2459 -0.0649 0.5953 0.1667 0.1343 0.1481 0.1555 0.2056 0.1998 0.1547 0.1553 0.1702
va: 1.2541 1.1193 1.1138 1.0895 1.0934 1.0867 1.1512 1.1421 1.1540 2.0880 2.0993 1.9909 2.0471 3.2507 3.2221 3.7968 3.8306 4.3650 3.9617 3.9966 4.0479 3.9697 4.1030 3.5473 4.2980 4.0660 3.9520 3.9262 3.9582 3.9599 3.8062 4.6063 0.9967 1.0507 1.0050 0.9869 1.0352 1.0038 0.9999 0.9998 0.9834
dispcorr: -0.022525263 hartree
energy: -2322.923980982882
dipole: -40.47859 36.06083 -4.41776 2.73668 -3.49852 -0.76184 -5.15556 3.51070 -1.64486
magnitude: 4.77520 au
magnitude: 12.13760 debye
