program: Orca
programVersion: 5.0.2
elementType: Cl F F F F F F F F O O O O N N C C C C C C C C C C C C C C C C C H H H H H H H H H
charge: 0
multiplicity: 1
keywords: wb97x-d3
keywords: def2-TZVPP
keywords: def2/J RIJCOSX
keywords: DEFGRID2
keywords: scfconv7
keywords: smallprint printgap noloewdin
keywords: NOSOSCF
formula: C17H9ClF8N2O4
InChI: InChI=1/C17H9ClF8N2O4/c18-8-6-7(4-5-11(8)31-16(22,23)14(21)32-17(24,25)26)27-15(30)28-13(29)12-9(19)2-1-3-10(12)20/h1-6,14,27-28H
41 atoms
Cl 2.460151 3.130337 -1.028161
F  4.51829 -0.237162 2.093975
F  5.722287 1.179989 0.999608
F  4.332584 0.55197 -1.309517
F  -5.337109 -2.90842 -0.241463
F  -6.61799 1.509476 0.5334
F  6.619514 -2.810505 -0.889958
F  5.127506 -2.08281 -2.259035
F  4.530263 -3.109247 -0.474223
O  3.617578 1.585952 1.161175
O  5.473595 -1.097001 -0.289201
O  -2.402464 1.842653 -1.438152
O  -3.89167 -0.859175 1.321602
N  -1.81928 0.648688 0.419698
N  -3.969244 0.550438 -0.469279
C  2.273666 1.328826 0.968292
C  -0.460833 0.938853 0.550129
C  4.525306 0.584212 1.022449
C  1.604944 2.009806 -0.038349
C  1.557999 0.476288 1.794035
C  0.247081 1.827539 -0.255182
C  0.209489 0.278933 1.581451
C  4.34694 -0.280374 -0.233799
C  -5.932214 -0.685635 0.14656
C  -2.668442 1.069277 -0.538383
C  -4.503797 -0.344942 0.405061
C  -6.303073 -1.993754 -0.131572
C  -6.951229 0.250165 0.23872
C  -7.615724 -2.368283 -0.320316
C  -8.279283 -0.075428 0.063203
C  -8.599407 -1.394899 -0.218294
C  5.423022 -2.260621 -0.975283
H  2.040983 -0.033632 2.615368
H  -0.230547 2.379332 -1.04738
H  -0.331726 -0.397018 2.23085
H  3.410647 -0.843395 -0.208496
H  -2.192418 -0.012401 1.094944
H  -4.564226 0.880635 -1.219687
H  -7.863698 -3.396893 -0.543035
H  -9.044306 0.683885 0.150366
H  -9.635012 -1.670951 -0.359491
elementType: Cl F O N C H
totalener: -2322.90428996 hartree
nucrepener: 3441.37564798 hartree
electener: -5764.27993793 hartree
twoeener: 4285.50558081 hartree
cpcmener: -0.04305844 hartree
kineticenergy: 2315.63643695 hartree
xcener: -181.034827295516 hartree
chargesum: -0.0000000
charge: -0.064956 -0.184227 -0.171569 -0.195429 -0.204754 -0.207779 -0.157087 -0.163669 -0.164481 -0.288204 -0.257942 -0.513446 -0.462312 -0.164304 -0.149067 0.084199 0.187085 0.446917 0.070533 -0.090116 -0.193552 -0.205627 0.207457 -0.130134 0.434849 0.407805 0.301261 0.318931 -0.244600 -0.246297 -0.064764 0.579246 0.158493 0.138233 0.147317 0.158277 0.204027 0.199574 0.154603 0.155200 0.170309
qa: -0.0650 -0.1842 -0.1716 -0.1954 -0.2048 -0.2078 -0.1571 -0.1637 -0.1645 -0.2882 -0.2579 -0.5134 -0.4623 -0.1643 -0.1491 0.0842 0.1871 0.4469 0.0705 -0.0901 -0.1936 -0.2056 0.2075 -0.1301 0.4348 0.4078 0.3013 0.3189 -0.2446 -0.2463 -0.0648 0.5792 0.1585 0.1382 0.1473 0.1583 0.2040 0.1996 0.1546 0.1552 0.1703
va: 1.2511 1.1158 1.1372 1.0878 1.0935 1.0866 1.1536 1.1418 1.1419 2.0904 2.1186 1.9933 2.0484 3.2583 3.2232 3.8797 3.8898 4.4437 4.0014 3.9700 4.0446 3.9736 4.0506 3.5509 4.2991 4.0654 3.9549 3.9251 3.9574 3.9617 3.8056 4.6359 1.0078 1.0527 1.0057 0.9835 1.0351 1.0037 0.9999 0.9998 0.9833
dispcorr: -0.019773528 hartree
energy: -2322.924063483964
dipole: -47.44999 42.96021 -4.48978 0.88684 -2.55584 -1.66900 5.36868 -4.95650 0.41218
magnitude: 4.80766 au
magnitude: 12.22010 debye
