program: Gaussian 09
title: 000055174
version: EM64L-G09RevD.01
frameworkgroup: C1[X(C20H26N2O3)]
method: RPBEPBE
basis: SDD
operation: Freq
keyword: #p
keyword: freq=noraman
keyword: PBEPBE/SDD
title: #p freq=noraman PBEPBE/SDD
converged: YES YES NO NO
title: Mulliken charges:
elementType: O O O N N C C C C C C C C C C C C C C C C C C C C H H H H H H H H H H H H H H H H H H H H H H H H H H
charge: -0.269107 -0.228343 -0.271822 -0.432106 -0.092005 -0.344693 0.435466 0.255312 0.469431 -0.361493 -0.268782 -0.396431 -0.438083 -0.359129 -0.420089 -0.228741 -0.226868 0.326161 -0.373181 -0.349086 -0.612957 -0.613002 -0.238048 -0.237133 -0.688017 0.250496 0.314099 0.193283 0.224745 0.243032 0.233255 0.279646 0.236531 0.243267 0.218962 0.229316 0.229272 0.237814 0.244331 0.224176 0.189660 0.228941 0.226061 0.226541 0.189645 0.231421 0.201906 0.201408 0.203238 0.230672 0.231030
chargesum: 0.00000
title: Mulliken charges with hydrogens summed into heavy atoms:
elementType: O O O N N C C C C C C C C C C C C C C C C C C C C
charge: -0.269107 -0.228343 -0.271822 -0.118007 -0.092005 -0.094197 0.435466 0.255312 0.469431 0.056534 0.207504 -0.116785 -0.201552 -0.115862 -0.201126 0.000574 0.002403 0.326161 -0.135367 -0.104755 0.029819 0.029245 -0.006627 0.166181 -0.023078
polarizability: 3.15278422e+02 -4.37349204e+01 2.47306445e+02 6.01093855e+00 1.51955890e+01 1.87504133e+02
1716.lowfreq: -9.4075 -1.4680 0.0004 0.0005 0.0008 3.9543 5.5643 15.1871 19.5906
frequency: -3.1408 14.9422 19.5633 30.5824 36.7087 41.7733 49.9595 61.3248 67.9150 89.4493 91.7905 112.9489 125.8818 143.4485 160.2047 190.2394 196.4170 203.7289 215.7257 230.3840 243.5035 250.7683 265.2291 293.2891 323.3195 334.0836 341.0987 355.4850 371.7581 402.7003 404.4681 413.6558 427.2505 457.7340 494.4720 514.9057 529.6133 549.6931 600.9137 613.5416 636.2774 690.3031 705.3715 713.0394 720.8199 745.3241 775.2983 791.7904 795.8421 815.5445 818.6970 825.9256 831.6934 857.6723 868.1658 886.3492 904.1125 910.8454 923.5454 938.7480 941.4411 981.7459 990.8174 995.0571 1000.7090 1027.3852 1034.6877 1035.1059 1041.9770 1062.8451 1081.3041 1088.4658 1095.3950 1098.6570 1112.3708 1119.1139 1137.4290 1138.3554 1141.7374 1169.7189 1173.6243 1181.0077 1191.3675 1202.4578 1218.9688 1237.0515 1258.0259 1261.4950 1266.6429 1285.3627 1290.9172 1316.4057 1318.5678 1330.6870 1337.5481 1364.1739 1374.9399 1385.0104 1385.5017 1398.8239 1420.5629 1422.5101 1441.7712 1444.9704 1460.5347 1461.8656 1466.3478 1472.2187 1472.7850 1476.0141 1479.0501 1482.0874 1482.3626 1485.9672 1489.4877 1511.9590 1587.1455 1593.4584 1611.7497 1638.4853 1643.8523 2852.3553 2859.2881 2877.0151 2943.0020 2995.5954 2997.8097 3006.3102 3021.9931 3022.4727 3031.7190 3043.3096 3080.6508 3087.1153 3092.8448 3097.4550 3104.1544 3119.6238 3124.0192 3128.0794 3139.1517 3139.9006 3149.6346 3160.5444 3164.3223 3165.5373 3569.7190
redmass: 3.0692 3.4666 4.2467 4.1977 3.6006 4.5517 4.3297 3.6615 3.0493 3.0559 4.2801 1.9565 3.7853 4.9895 4.7096 3.8163 2.6483 1.4036 1.8577 3.4425 1.2286 1.9772 2.7590 3.9860 1.5523 3.6201 3.0758 3.1690 5.9701 2.8378 3.6713 3.0397 2.6270 3.1206 3.6804 2.3030 5.8265 4.5575 5.3588 6.4465 6.5126 6.8054 1.9581 3.4942 4.5058 3.7983 2.3100 1.3283 1.1850 1.6197 3.9030 4.3723 1.1487 1.2552 4.4189 5.4476 3.1430 1.4208 2.8889 2.0150 1.3462 1.4346 5.2773 2.6913 1.3277 2.2242 1.5413 2.2403 2.9185 1.6116 1.7047 1.4547 2.3621 3.6475 2.0356 1.9575 1.4437 1.4685 2.3104 1.4144 1.0567 1.3745 1.1200 2.3436 2.3644 1.7139 1.5538 1.1423 2.5080 1.2439 1.8788 1.4372 1.4437 1.4264 1.3205 1.8274 2.0425 1.5118 5.7307 1.2783 1.1435 3.2805 2.1511 1.1653 1.0401 1.0488 1.0743 1.0800 1.5436 1.0578 1.1305 1.7831 1.2324 1.0609 1.1421 2.5019 5.9278 6.0578 6.0406 6.7665 9.0036 1.0569 1.0614 1.0657 1.0552 1.0361 1.1072 1.0841 1.0597 1.0718 1.0714 1.0884 1.1012 1.1010 1.0989 1.1079 1.1012 1.0891 1.0852 1.0881 1.0922 1.0868 1.0964 1.0947 1.0954 1.1016 1.0773
irintensity: 0.4401 0.0646 0.3789 0.5558 0.1173 0.0552 0.8169 0.6254 1.1475 1.5318 0.7221 4.3587 0.5385 0.6635 0.3268 1.9562 0.5897 2.1634 2.2420 2.1493 0.9800 1.0029 14.5108 16.3992 74.6311 2.4287 12.8869 4.5949 12.9938 0.5715 7.1528 0.8891 4.4732 1.9935 11.9948 18.3654 15.6994 9.4730 9.6952 0.1063 5.9257 1.9596 48.1581 2.5300 27.2970 22.9206 43.7235 18.7518 3.3737 78.9149 12.1649 0.7830 0.3396 0.3592 15.3329 0.6610 42.4500 2.9384 40.3549 11.3775 0.4062 0.3150 0.8644 3.1867 0.4841 12.8483 17.8016 58.4038 76.7713 3.5021 38.4923 4.3207 32.5983 294.2802 63.4782 52.9376 4.1769 1.9295 20.2707 1.6596 0.6285 83.2014 1.4336 15.8584 267.1020 8.3257 9.2839 0.1194 11.7611 2.7111 13.0183 18.8856 18.7328 13.3540 20.6899 51.9438 16.8010 4.2464 1.1181 28.4263 2.3830 41.1201 9.4546 2.7880 11.0715 7.4431 8.6767 14.8374 8.8328 14.2839 45.7628 23.6393 10.5746 17.3886 93.6626 450.5522 3.0183 3.1208 5.8166 30.9512 135.4380 69.3216 102.5389 164.2189 43.0178 32.4392 43.4685 15.9491 13.8757 34.1296 53.4947 10.1841 21.1800 50.1018 31.0841 33.1316 35.8444 18.1496 3.2341 0.6119 15.5402 23.8093 26.8864 18.6828 2.3238 27.4080 33.4110
temp: 298.150 k
press: 1.00000 atm
elementType: 8 8 8 7 7 6 6 6 6 6 6 6 6 6 6 6 6 6 6 6 6 6 6 6 6 1 1 1 1 1 1 1 1 1 1 1 1 1 1 1 1 1 1 1 1 1 1 1 1 1 1
symmnumber: 1
zpe: 1106650.7 jmol-1
zpe.correction: 0.421501 hartree
zpe.thermalcorrener: 0.446949 hartree
zpe.thermalcorrenthalpy: 0.447893 hartree
zpe.thermalcorrgfe: 0.362536 hartree
zpe.sumelectzpe: -1110.997365 hartree
zpe.sumelectthermal: -1110.971918 hartree
zpe.sumelectthermalent: -1110.970973 hartree
zpe.sumelectthermalfe: -1111.056331 hartree
dipole: 1.6563 2.0647 2.3820
dipole: 3.5609
quadrupole: -142.0027 -127.7402 -150.3757
quadrupole: -14.0346 1.1975 6.1021
quadrupole: -1.9631 12.2993 -10.3362 -14.0346 1.1975 6.1021
hfenergy: -1111.4188663 hartree
pointgroup: C01 [X(C20H26N2O3)]
dipole: 0.8570142 0.4977277 0.9902061 debye
polarizability: 288.7964926|-55.2712736|269.4828079|1.4695321|23.9668218|191.8096993 unknown
InChI: InChI=1S/C20H26N2O3/c1-4-24-18-12-10-17(11-13-18)21-19(16-8-6-5-7-9-16)20(23)25-15-14-22(2)3/h5-13,19,21H,4,14-15H2,1-3H3
charge 0 multiplicity 1
51 atoms
O  1.923603 0.644506 0.233986
O  1.293848 -0.065855 -1.896842
O  -5.37067 1.034066 0.227018
N  -0.544187 -1.873935 -0.391095
N  3.722445 3.933467 0.338948
C  0.767475 -1.475679 0.103116
C  1.752753 -2.643669 -0.012207
C  1.333139 -0.246258 -0.661314
C  -1.706054 -1.098621 -0.226637
C  3.026943 2.716437 0.81565
C  2.582479 1.845623 -0.365216
C  2.210662 -3.074883 -1.284292
C  2.185776 -3.326497 1.14984
C  -1.712526 0.121995 0.500447
C  -2.937623 -1.558065 -0.781714
C  3.083088 -4.181206 -1.387146
C  3.062834 -4.429439 1.046151
C  -4.121334 0.385688 0.119651
C  -2.910016 0.855759 0.676342
C  -4.123425 -0.827659 -0.614049
C  4.643436 4.495654 1.347905
C  2.804027 4.959391 -0.198197
C  3.511486 -4.861416 -0.223476
C  -5.411112 2.300744 0.974981
C  -6.857548 2.789123 0.943121
H  0.693816 -1.177266 1.166121
H  -0.570461 -2.646891 -1.05519
H  2.141508 2.949193 1.459133
H  3.730197 2.128244 1.432405
H  3.446886 1.519397 -0.968439
H  1.855948 2.345241 -1.029455
H  1.901938 -2.530873 -2.184907
H  1.831866 -2.997943 2.134136
H  -0.788664 0.519453 0.93312
H  -2.958556 -2.498199 -1.346829
H  3.434347 -4.506794 -2.372632
H  3.392735 -4.950718 1.951595
H  -2.873504 1.79087 1.243536
H  -5.066981 -1.180275 -1.042163
H  5.203187 5.339138 0.905469
H  4.124968 4.872581 2.266001
H  5.374423 3.727797 1.656679
H  2.197423 4.546193 -1.021913
H  3.391708 5.800076 -0.607415
H  2.10536 5.368457 0.575816
H  4.191167 -5.717036 -0.30451
H  -4.728652 3.036468 0.499063
H  -5.068995 2.1296 2.017738
H  -6.951073 3.743417 1.493065
H  -7.52763 2.047391 1.410508
H  -7.190461 2.948909 -0.096703
