program: Orca
programVersion: 5.0.2
elementType: Cl F F F F F F F F O O O O N N C C C C C C C C C C C C C C C C C H H H H H H H H H
charge: 0
multiplicity: 1
keywords: wb97x-d3
keywords: def2-TZVPP
keywords: def2/J RIJCOSX
keywords: DEFGRID2
keywords: scfconv7
keywords: smallprint printgap noloewdin
keywords: NOSOSCF
formula: C17H9ClF8N2O4
InChI: InChI=1/C17H9ClF8N2O4/c18-8-6-7(4-5-11(8)31-16(22,23)14(21)32-17(24,25)26)27-15(30)28-13(29)12-9(19)2-1-3-10(12)20/h1-6,14,27-28H
41 atoms
Cl 2.669019 -1.226854 2.306689
F  5.934216 1.165705 1.208611
F  4.918892 2.769048 0.18404
F  5.844235 0.841872 -1.447315
F  -5.357651 -2.720103 -0.840824
F  -6.205436 1.668872 0.514413
F  4.206594 -2.787164 -0.459319
F  4.779391 -1.748076 -2.25576
F  2.849335 -1.405619 -1.390118
O  3.803166 1.306889 1.444551
O  4.660338 -0.69335 -0.299546
O  -2.109119 2.122158 -1.359775
O  -3.643861 -1.056326 0.787839
N  -1.540974 0.506097 0.153012
N  -3.702822 0.682881 -0.682405
C  2.49868 1.143574 1.027827
C  -0.191906 0.776609 0.383488
C  4.80976 1.474438 0.550652
C  1.835381 -0.013836 1.415065
C  1.807258 2.113005 0.324172
C  0.504931 -0.196831 1.099357
C  0.473538 1.936443 -0.009061
C  4.708236 0.629057 -0.728927
C  -5.72661 -0.510441 -0.179471
C  -2.387338 1.167436 -0.660259
C  -4.264356 -0.328068 0.035821
C  -6.226744 -1.740674 -0.587391
C  -6.654855 0.488638 0.078903
C  -7.573313 -1.973912 -0.762369
C  -8.012233 0.299462 -0.068853
C  -8.460469 -0.940836 -0.496837
C  4.126489 -1.638891 -1.103078
H  2.298288 3.031852 0.033034
H  0.002977 -1.103767 1.41191
H  -0.025855 2.721719 -0.550488
H  3.85261 0.916702 -1.345481
H  -1.923999 -0.302727 0.635376
H  -4.300581 1.195229 -1.319299
H  -7.920251 -2.941694 -1.097433
H  -8.702122 1.102573 0.15048
H  -9.521132 -1.107249 -0.622961
elementType: Cl F O N C H
totalener: -2322.90427552 hartree
nucrepener: 3534.10318828 hartree
electener: -5857.00746379 hartree
twoeener: 4378.26028400 hartree
cpcmener: -0.04262548 hartree
kineticenergy: 2315.65416545 hartree
xcener: -181.039935299998 hartree
chargesum: 0.0000000
charge: -0.064938 -0.171798 -0.183888 -0.196896 -0.203456 -0.207520 -0.156790 -0.162336 -0.162997 -0.283999 -0.256209 -0.513270 -0.463557 -0.170754 -0.151634 0.189545 0.172484 0.443604 -0.018944 -0.140816 -0.151417 -0.188192 0.186504 -0.128731 0.433643 0.413075 0.302070 0.310260 -0.241862 -0.241845 -0.064069 0.586171 0.160415 0.129307 0.158418 0.158835 0.204442 0.197743 0.154135 0.155531 0.169734
qa: -0.0649 -0.1718 -0.1839 -0.1969 -0.2035 -0.2075 -0.1568 -0.1623 -0.1630 -0.2840 -0.2562 -0.5133 -0.4636 -0.1708 -0.1516 0.1895 0.1725 0.4436 -0.0189 -0.1408 -0.1514 -0.1882 0.1865 -0.1287 0.4336 0.4131 0.3021 0.3103 -0.2419 -0.2418 -0.0641 0.5862 0.1604 0.1293 0.1584 0.1588 0.2044 0.1977 0.1541 0.1555 0.1697
va: 1.2480 1.1351 1.1130 1.0867 1.0950 1.0873 1.1558 1.1465 1.1385 2.0902 2.1055 1.9925 2.0468 3.2525 3.2213 3.8170 3.8878 4.4006 3.9730 4.0207 4.0129 3.9807 4.0963 3.5482 4.3027 4.0633 3.9539 3.9283 3.9559 3.9578 3.8076 4.6238 1.0099 1.0274 1.0247 0.9853 1.0385 1.0054 1.0003 0.9996 0.9836
dispcorr: -0.021372315 hartree
energy: -2322.925647832235
dipole: -43.90436 39.42996 -4.47440 7.02319 -6.99093 0.03227 -1.47174 0.45224 -1.01950
magnitude: 4.58919 au
magnitude: 11.66479 debye
