program: Orca
programVersion: 5.0.2
elementType: Cl F F F F F F F F O O O O N N C C C C C C C C C C C C C C C C C H H H H H H H H H
charge: 0
multiplicity: 1
keywords: wb97x-d3
keywords: def2-TZVPP
keywords: def2/J RIJCOSX
keywords: DEFGRID2
keywords: scfconv7
keywords: smallprint printgap noloewdin
keywords: NOSOSCF
formula: C17H9ClF8N2O4
InChI: InChI=1/C17H9ClF8N2O4/c18-8-6-7(4-5-11(8)31-16(22,23)14(21)32-17(24,25)26)27-15(30)28-13(29)12-9(19)2-1-3-10(12)20/h1-6,14,27-28H
41 atoms
Cl 2.008246 -1.923767 1.36575
F  3.560186 1.526475 1.220508
F  4.375776 1.918432 -0.738049
F  5.210763 -0.571117 1.583228
F  -6.575095 2.17672 0.900482
F  -6.5157 -2.30518 -0.392563
F  7.847066 -1.151359 0.366222
F  7.922461 0.623094 -0.826626
F  7.474356 -1.264913 -1.750542
O  3.321536 -0.01119 -0.379401
O  5.953557 -0.372048 -0.525556
O  -2.817702 1.819049 -1.829437
O  -4.378909 -0.795196 0.964086
N  -2.221372 0.352213 -0.180796
N  -4.451829 0.779116 -0.682703
C  1.953444 0.166487 -0.331852
C  -0.829209 0.351948 -0.2778
C  4.129145 0.936856 0.155665
C  1.207172 -0.711608 0.44164
C  1.303625 1.143988 -1.060387
C  -0.170656 -0.632442 0.460208
C  -0.078045 1.251024 -1.032618
C  5.460382 0.314122 0.583431
C  -6.502009 -0.059674 0.2385
C  -3.097764 1.030374 -0.948013
C  -5.011989 -0.06619 0.223947
C  -7.240343 1.059557 0.592331
C  -7.209604 -1.219348 -0.043927
C  -8.617376 1.049629 0.65845
C  -8.585458 -1.277158 0.000095
C  -9.280751 -0.129929 0.35537
C  7.287489 -0.532445 -0.669272
H  1.866795 1.834896 -1.673012
H  -0.738875 -1.336291 1.05503
H  -0.542731 2.037534 -1.60239
H  6.138176 1.086836 0.956745
H  -2.623962 -0.303244 0.483675
H  -5.077745 1.310072 -1.276229
H  -9.157657 1.941379 0.945332
H  -9.101833 -2.196636 -0.23903
H  -10.360472 -0.157153 0.39889
elementType: Cl F O N C H
totalener: -2322.90594523 hartree
nucrepener: 3383.40634325 hartree
electener: -5706.31228848 hartree
oneelecener: -9934.83850212 hartree
twoeener: 4228.52621364 hartree
cpcmener: -0.04162782 hartree
kineticenergy: 2315.65666976 hartree
xcener: -181.037465625149 hartree
chargesum: -0.0000000
charge: -0.063210 -0.182544 -0.186408 -0.195701 -0.208304 -0.205134 -0.164873 -0.164469 -0.157544 -0.312741 -0.251858 -0.512634 -0.461796 -0.170448 -0.148436 0.136998 0.187035 0.473832 0.057360 -0.107978 -0.185039 -0.220582 0.218022 -0.127142 0.434094 0.405611 0.316842 0.305257 -0.245652 -0.246982 -0.065420 0.574344 0.153119 0.130263 0.157656 0.149706 0.204341 0.199928 0.155238 0.154911 0.170336
qa: -0.0632 -0.1825 -0.1864 -0.1957 -0.2083 -0.2051 -0.1649 -0.1645 -0.1575 -0.3127 -0.2519 -0.5126 -0.4618 -0.1704 -0.1484 0.1370 0.1870 0.4738 0.0574 -0.1080 -0.1850 -0.2206 0.2180 -0.1271 0.4341 0.4056 0.3168 0.3053 -0.2457 -0.2470 -0.0654 0.5743 0.1531 0.1303 0.1577 0.1497 0.2043 0.1999 0.1552 0.1549 0.1703
va: 1.2546 1.1201 1.1210 1.0891 1.0863 1.0932 1.1404 1.1413 1.1521 2.1120 2.1191 1.9931 2.0485 3.2504 3.2204 3.8284 3.8594 4.3193 4.0243 4.0438 4.0360 4.0008 4.1003 3.5462 4.3012 4.0667 3.9264 3.9519 3.9602 3.9595 3.8052 4.6434 1.0094 1.0274 1.0274 0.9910 1.0383 1.0034 0.9997 1.0000 0.9833
dispcorr: -0.019144663 hartree
energy: -2322.925089895275
dipole: -52.05797 48.66803 -3.38994 5.67830 -4.86252 0.81577 -3.08930 3.24134 0.15204
magnitude: 3.49003 au
magnitude: 8.87095 debye
