program: Orca
programVersion: 5.0.2
elementType: Cl F F F F F F F F O O O O N N C C C C C C C C C C C C C C C C C H H H H H H H H H
charge: 0
multiplicity: 1
keywords: wb97x-d3
keywords: def2-TZVPP
keywords: def2/J RIJCOSX
keywords: DEFGRID2
keywords: scfconv7
keywords: smallprint printgap noloewdin
keywords: NOSOSCF
formula: C17H9ClF8N2O4
InChI: InChI=1/C17H9ClF8N2O4/c18-8-6-7(4-5-11(8)31-16(22,23)14(21)32-17(24,25)26)27-15(30)28-13(29)12-9(19)2-1-3-10(12)20/h1-6,14,27-28H
41 atoms
Cl 2.850223 -1.899683 -1.813961
F  4.768254 2.303077 -0.28251
F  6.095253 1.040863 -1.433902
F  6.049196 0.404377 1.161078
F  -6.229664 1.137725 -1.312083
F  -5.071049 -2.129721 1.823355
F  3.45974 -1.986168 1.397459
F  2.11429 -0.503048 2.186423
F  4.056642 -0.777156 3.06282
O  3.986162 0.792735 -1.736057
O  3.813832 0.194885 1.078267
O  -2.125408 2.557238 -0.073416
O  -3.496667 -1.322711 -0.451451
N  -1.460611 0.450281 -0.657848
N  -3.642622 0.900159 0.020396
C  2.642488 0.76255 -1.430376
C  -0.102251 0.631622 -0.918568
C  4.923076 1.063531 -0.789624
C  1.977327 -0.456733 -1.458648
C  1.918002 1.913342 -1.184734
C  0.62297 -0.52664 -1.203406
C  0.557623 1.859866 -0.924934
C  4.997622 0.056282 0.369168
C  -5.592563 -0.486865 0.245107
C  -2.348907 1.376748 -0.241374
C  -4.148168 -0.357658 -0.103273
C  -6.590162 0.245974 -0.384458
C  -6.004678 -1.422117 1.186956
C  -7.929708 0.074102 -0.106544
C  -7.330432 -1.621474 1.506195
C  -8.28885 -0.866161 0.846864
C  3.380306 -0.767313 1.91931
H  2.4062 2.877871 -1.20653
H  0.125288 -1.488508 -1.219488
H  0.033693 2.781846 -0.73853
H  5.164386 -0.955422 -0.009571
H  -1.808126 -0.502266 -0.729148
H  -4.258228 1.624588 0.368066
H  -8.674255 0.660463 -0.62776
H  -7.605625 -2.351512 2.255321
H  -9.334266 -1.013205 1.081225
elementType: Cl F O N C H
totalener: -2322.91319213 hartree
nucrepener: 3562.05751152 hartree
electener: -5884.97070365 hartree
twoeener: 4406.58261452 hartree
cpcmener: -0.03295183 hartree
kineticenergy: 2315.66330939 hartree
xcener: -181.040029357611 hartree
chargesum: -0.0000000
charge: -0.064899 -0.180665 -0.170159 -0.197178 -0.206030 -0.200567 -0.164399 -0.158066 -0.160459 -0.296274 -0.251447 -0.486199 -0.445889 -0.171178 -0.152334 0.117506 0.191693 0.477881 0.050338 -0.082631 -0.183242 -0.219795 0.170699 -0.131584 0.421590 0.401480 0.309557 0.298513 -0.240047 -0.237824 -0.064077 0.591568 0.147891 0.127777 0.159263 0.135386 0.199351 0.192726 0.152892 0.152155 0.166678
qa: -0.0649 -0.1807 -0.1702 -0.1972 -0.2060 -0.2006 -0.1644 -0.1581 -0.1605 -0.2963 -0.2514 -0.4862 -0.4459 -0.1712 -0.1523 0.1175 0.1917 0.4779 0.0503 -0.0826 -0.1832 -0.2198 0.1707 -0.1316 0.4216 0.4015 0.3096 0.2985 -0.2400 -0.2378 -0.0641 0.5916 0.1479 0.1278 0.1593 0.1354 0.1994 0.1927 0.1529 0.1522 0.1667
va: 1.2538 1.1224 1.1384 1.0905 1.0890 1.0989 1.1421 1.1526 1.1492 2.0957 2.0953 2.0255 2.0685 3.2517 3.2172 3.8677 3.8644 4.3566 3.9453 4.0070 4.0366 4.0016 4.1143 3.5485 4.3138 4.0783 3.9314 3.9584 3.9601 3.9572 3.8135 4.6148 1.0089 1.0277 1.0283 0.9971 1.0427 1.0091 1.0008 1.0010 0.9848
dispcorr: -0.021582032 hartree
energy: -2322.934774158566
dipole: -40.41367 36.84250 -3.57117 4.59395 -5.31428 -0.72033 -4.47901 4.84213 0.36312
magnitude: 3.66114 au
magnitude: 9.30589 debye
