program: Orca
programVersion: 5.0.2
elementType: Cl F F F F F F F F O O O O N N C C C C C C C C C C C C C C C C C H H H H H H H H H
charge: 0
multiplicity: 1
keywords: wb97x-d3
keywords: def2-TZVPP
keywords: def2/J RIJCOSX
keywords: DEFGRID2
keywords: scfconv7
keywords: smallprint printgap noloewdin
keywords: NOSOSCF
formula: C17H9ClF8N2O4
InChI: InChI=1/C17H9ClF8N2O4/c18-8-6-7(4-5-11(8)31-16(22,23)14(21)32-17(24,25)26)27-15(30)28-13(29)12-9(19)2-1-3-10(12)20/h1-6,14,27-28H
41 atoms
Cl 2.179358 -1.615512 2.077261
F  3.965465 1.114519 -1.449506
F  3.609642 -0.933461 -0.880982
F  5.516809 -0.780997 1.063481
F  -6.454248 -2.109412 -0.587481
F  -6.851195 2.512861 -0.022814
F  8.248252 -0.60284 -0.154359
F  7.784084 1.368741 -0.853147
F  7.959181 -0.255862 -2.254318
O  3.230863 0.681357 0.609676
O  6.222418 -0.216504 -0.995087
O  -2.830866 -1.306562 1.923827
O  -4.517942 1.106664 -0.97429
N  -2.29771 0.184468 0.278838
N  -4.508684 -0.392179 0.73941
C  1.865476 0.53118 0.485872
C  -0.908592 0.246715 0.391371
C  4.014508 0.257896 -0.407427
C  1.235938 -0.502094 1.161639
C  1.102547 1.420184 -0.251369
C  -0.140971 -0.650893 1.130699
C  -0.270308 1.278631 -0.299786
C  5.457343 0.17413 0.097074
C  -6.593526 0.20694 -0.299086
C  -3.146123 -0.547404 1.031271
C  -5.111648 0.358094 -0.223608
C  -7.217715 -1.015895 -0.507646
C  -7.416335 1.325555 -0.241771
C  -8.582668 -1.1413 -0.655939
C  -8.786216 1.248632 -0.36994
C  -9.360149 0.003983 -0.582462
C  7.537131 0.076529 -1.048491
H  1.572529 2.243232 -0.772471
H  -0.590249 -1.468892 1.668735
H  -0.853624 1.985496 -0.876726
H  5.769341 1.130483 0.524916
H  -2.720674 0.812164 -0.398849
H  -5.100173 -0.937219 1.354066
H  -9.025286 -2.112835 -0.829365
H  -9.390513 2.143229 -0.305123
H  -10.433045 -0.074168 -0.692357
elementType: Cl F O N C H
totalener: -2322.91853801 hartree
nucrepener: 3368.93075838 hartree
electener: -5691.84929639 hartree
oneelecener: -9905.83563652 hartree
twoeener: 4213.98634013 hartree
cpcmener: -0.03550244 hartree
kineticenergy: 2315.67270264 hartree
xcener: -181.039301904588 hartree
chargesum: -0.0000000
charge: -0.063498 -0.186427 -0.178696 -0.194691 -0.205971 -0.200696 -0.163533 -0.166340 -0.157117 -0.314328 -0.251603 -0.487024 -0.446147 -0.173238 -0.153884 0.147071 0.189766 0.470780 0.059815 -0.111854 -0.186794 -0.220870 0.222017 -0.128643 0.422411 0.401963 0.304024 0.301648 -0.239421 -0.239597 -0.063611 0.578684 0.152954 0.138402 0.143563 0.134109 0.200569 0.193597 0.153630 0.152163 0.166817
qa: -0.0635 -0.1864 -0.1787 -0.1947 -0.2060 -0.2007 -0.1635 -0.1663 -0.1571 -0.3143 -0.2516 -0.4870 -0.4461 -0.1732 -0.1539 0.1471 0.1898 0.4708 0.0598 -0.1119 -0.1868 -0.2209 0.2220 -0.1286 0.4224 0.4020 0.3040 0.3016 -0.2394 -0.2396 -0.0636 0.5787 0.1530 0.1384 0.1436 0.1341 0.2006 0.1936 0.1536 0.1522 0.1668
va: 1.2555 1.1211 1.1251 1.0891 1.0891 1.0987 1.1413 1.1393 1.1535 2.1056 2.1232 2.0233 2.0669 3.2459 3.2162 3.8342 3.8638 4.3237 4.0288 4.0255 4.0359 3.9975 4.0952 3.5457 4.3142 4.0808 3.9353 3.9570 3.9602 3.9563 3.8125 4.6365 1.0038 1.0495 1.0069 0.9976 1.0399 1.0085 1.0003 1.0010 0.9848
dispcorr: -0.018906581 hartree
energy: -2322.937444588886
dipole: -53.83187 50.11006 -3.72181 5.36863 -4.07831 1.29032 1.67650 -2.05058 -0.37408
magnitude: 3.95686 au
magnitude: 10.05754 debye
