program: Orca
programVersion: 5.0.2
elementType: Cl F F F F F F F F O O O O N N C C C C C C C C C C C C C C C C C H H H H H H H H H
charge: 0
multiplicity: 1
keywords: wb97x-d3
keywords: def2-TZVPP
keywords: def2/J RIJCOSX
keywords: DEFGRID2
keywords: scfconv7
keywords: smallprint printgap noloewdin
keywords: NOSOSCF
formula: C17H9ClF8N2O4
InChI: InChI=1/C17H9ClF8N2O4/c18-8-6-7(4-5-11(8)31-16(22,23)14(21)32-17(24,25)26)27-15(30)28-13(29)12-9(19)2-1-3-10(12)20/h1-6,14,27-28H
41 atoms
Cl 1.892461 -1.801677 1.739654
F  4.110451 1.26204 -1.178237
F  3.554068 -0.802267 -0.914872
F  5.351956 -1.082496 1.118538
F  -6.339745 -2.21991 -1.086586
F  -6.85594 1.850377 1.134168
F  8.065851 -1.242605 -0.019082
F  7.996711 0.875067 -0.345577
F  7.979096 -0.471811 -2.024042
O  3.235693 0.622891 0.772353
O  6.197801 -0.349927 -0.835377
O  -2.819896 2.275181 -1.20207
O  -4.46698 -0.92794 0.828141
N  -2.292639 0.541675 0.190624
N  -4.483881 0.943563 -0.472748
C  1.870936 0.628509 0.570639
C  -0.903812 0.639238 0.275146
C  4.031578 0.272566 -0.263992
C  1.115991 -0.453586 1.00365
C  1.230705 1.713161 0.002676
C  -0.256845 -0.448603 0.86366
C  -0.147453 1.730629 -0.149605
C  5.433573 -0.017549 0.276425
C  -6.551535 -0.173483 0.013292
C  -3.13133 1.315862 -0.528319
C  -5.070055 -0.099731 0.175487
C  -7.14055 -1.273666 -0.593395
C  -7.402605 0.798768 0.516532
C  -8.506276 -1.407284 -0.721031
C  -8.775097 0.707015 0.419854
C  -9.316478 -0.405046 -0.207344
C  7.543814 -0.293678 -0.789855
H  1.805434 2.574509 -0.311238
H  -0.831171 -1.300391 1.206387
H  -0.607701 2.599599 -0.589509
H  5.822498 0.841333 0.829812
H  -2.712954 -0.255284 0.661454
H  -5.07973 1.538213 -1.035742
H  -8.92673 -2.275275 -1.210643
H  -9.405528 1.484851 0.829042
H  -10.390559 -0.494315 -0.295822
elementType: Cl F O N C H
totalener: -2322.91779781 hartree
nucrepener: 3371.75402106 hartree
electener: -5694.67181887 hartree
oneelecener: -9911.36274451 hartree
twoeener: 4216.69092564 hartree
cpcmener: -0.03496069 hartree
kineticenergy: 2315.67090120 hartree
xcener: -181.038276299123 hartree
chargesum: -0.0000000
charge: -0.060532 -0.185404 -0.178105 -0.194849 -0.202052 -0.206353 -0.163413 -0.166190 -0.157577 -0.314819 -0.250687 -0.484220 -0.441312 -0.175196 -0.153312 0.143696 0.197785 0.469724 0.061036 -0.115607 -0.185318 -0.223809 0.219342 -0.130005 0.419625 0.394765 0.305415 0.312367 -0.245998 -0.245098 -0.063046 0.577769 0.152609 0.127751 0.154714 0.137230 0.200014 0.196365 0.152306 0.153509 0.166878
qa: -0.0605 -0.1854 -0.1781 -0.1948 -0.2021 -0.2064 -0.1634 -0.1662 -0.1576 -0.3148 -0.2507 -0.4842 -0.4413 -0.1752 -0.1533 0.1437 0.1978 0.4697 0.0610 -0.1156 -0.1853 -0.2238 0.2193 -0.1300 0.4196 0.3948 0.3054 0.3124 -0.2460 -0.2451 -0.0630 0.5778 0.1526 0.1278 0.1547 0.1372 0.2000 0.1964 0.1523 0.1535 0.1669
va: 1.2577 1.1227 1.1258 1.0889 1.0974 1.0884 1.1413 1.1397 1.1530 2.1039 2.1263 2.0279 2.0731 3.2443 3.2111 3.8403 3.8455 4.3267 4.0200 4.0366 4.0387 4.0066 4.0979 3.5463 4.3177 4.0824 3.9587 3.9350 3.9635 3.9642 3.8089 4.6376 1.0037 1.0283 1.0281 0.9958 1.0434 1.0053 1.0010 1.0004 0.9847
dispcorr: -0.018938550 hartree
energy: -2322.936736358220
dipole: -53.10793 49.55807 -3.54987 8.56517 -7.69447 0.87070 0.80679 -0.64798 0.15881
magnitude: 3.65854 au
magnitude: 9.29926 debye
