program: Orca
programVersion: 5.0.2
elementType: Cl F F F F F F F F O O O O N N C C C C C C C C C C C C C C C C C H H H H H H H H H
charge: 0
multiplicity: 1
keywords: wb97x-d3
keywords: def2-TZVPP
keywords: def2/J RIJCOSX
keywords: DEFGRID2
keywords: scfconv7
keywords: smallprint printgap noloewdin
keywords: NOSOSCF
formula: C17H9ClF8N2O4
InChI: InChI=1/C17H9ClF8N2O4/c18-8-6-7(4-5-11(8)31-16(22,23)14(21)32-17(24,25)26)27-15(30)28-13(29)12-9(19)2-1-3-10(12)20/h1-6,14,27-28H
41 atoms
Cl 1.960729 -2.073703 1.620834
F  3.467603 0.738556 1.749335
F  3.990602 1.861021 -0.010631
F  5.482787 -1.062955 1.234505
F  -6.869556 -2.333805 0.000675
F  -6.22503 2.277058 0.363329
F  8.043356 -0.634158 -0.162028
F  7.741977 1.470556 -0.409551
F  7.54056 0.154628 -2.099135
O  3.34648 -0.264119 -0.24228
O  5.992549 0.107841 -0.613614
O  -2.737297 1.251209 -2.187335
O  -4.43888 -0.965509 0.862667
N  -2.208542 -0.107915 -0.428515
N  -4.417577 0.406724 -0.954976
C  1.972188 -0.173747 -0.293988
C  -0.814055 -0.087674 -0.450841
C  4.016639 0.623375 0.526363
C  1.198695 -0.985286 0.525394
C  1.345595 0.66594 -1.1939
C  -0.179217 -0.94727 0.447723
C  -0.036293 0.717489 -1.282525
C  5.471969 0.175632 0.673673
C  -6.495321 -0.034068 0.164282
C  -3.05389 0.55254 -1.247075
C  -5.022498 -0.249308 0.073838
C  -7.373371 -1.110193 0.16633
C  -7.050461 1.227502 0.332085
C  -8.735852 -0.955226 0.306055
C  -8.404834 1.431904 0.48777
C  -9.24135 0.326488 0.469168
C  7.317364 0.274628 -0.804947
H  1.938051 1.282527 -1.856824
H  -0.76559 -1.588066 1.094115
H  -0.481308 1.388657 -1.997064
H  6.017251 0.863922 1.32669
H  -2.637741 -0.685372 0.289024
H  -5.00845 0.912596 -1.603149
H  -9.3879 -1.817884 0.288449
H  -8.794598 2.431529 0.624889
H  -10.307454 0.465683 0.585518
elementType: Cl F O N C H
totalener: -2322.91821111 hartree
nucrepener: 3384.14051634 hartree
electener: -5707.05872745 hartree
oneelecener: -9936.26496946 hartree
twoeener: 4229.20624201 hartree
cpcmener: -0.03500194 hartree
kineticenergy: 2315.67910239 hartree
xcener: -181.040031797787 hartree
chargesum: -0.0000000
charge: -0.061814 -0.180485 -0.186044 -0.193714 -0.200810 -0.206121 -0.163707 -0.165286 -0.156210 -0.306767 -0.248861 -0.486342 -0.444150 -0.169825 -0.154399 0.152940 0.187986 0.474270 0.053314 -0.126370 -0.182010 -0.218561 0.211319 -0.126232 0.421552 0.395893 0.305725 0.300890 -0.241096 -0.236850 -0.064223 0.573944 0.151721 0.127070 0.159327 0.139149 0.198557 0.193814 0.152252 0.153684 0.166470
qa: -0.0618 -0.1805 -0.1860 -0.1937 -0.2008 -0.2061 -0.1637 -0.1653 -0.1562 -0.3068 -0.2489 -0.4863 -0.4441 -0.1698 -0.1544 0.1529 0.1880 0.4743 0.0533 -0.1264 -0.1820 -0.2186 0.2113 -0.1262 0.4216 0.3959 0.3057 0.3009 -0.2411 -0.2368 -0.0642 0.5739 0.1517 0.1271 0.1593 0.1391 0.1986 0.1938 0.1523 0.1537 0.1665
va: 1.2560 1.1256 1.1239 1.0916 1.0990 1.0888 1.1418 1.1405 1.1547 2.1144 2.1226 2.0248 2.0693 3.2495 3.2111 3.8357 3.8727 4.3257 4.0145 4.0483 4.0247 3.9919 4.1019 3.5458 4.3148 4.0852 3.9578 3.9348 3.9571 3.9608 3.8138 4.6432 1.0037 1.0282 1.0277 0.9942 1.0426 1.0081 1.0011 1.0001 0.9849
dispcorr: -0.018995285 hartree
energy: -2322.937206394968
dipole: -51.71431 48.29893 -3.41538 3.55017 -2.64778 0.90239 -4.00340 4.26718 0.26378
magnitude: 3.54241 au
magnitude: 9.00410 debye
