program: Orca
programVersion: 5.0.2
elementType: Cl F F F F F F F F O O O O N N C C C C C C C C C C C C C C C C C H H H H H H H H H
charge: 0
multiplicity: 1
keywords: wb97x-d3
keywords: def2-TZVPP
keywords: def2/J RIJCOSX
keywords: DEFGRID2
keywords: scfconv7
keywords: smallprint printgap noloewdin
keywords: NOSOSCF
formula: C17H9ClF8N2O4
InChI: InChI=1/C17H9ClF8N2O4/c18-8-6-7(4-5-11(8)31-16(22,23)14(21)32-17(24,25)26)27-15(30)28-13(29)12-9(19)2-1-3-10(12)20/h1-6,14,27-28H
41 atoms
Cl 2.227505 -0.728622 2.666053
F  3.697923 1.623942 1.01629
F  3.871531 1.552414 -1.126261
F  5.726022 -0.243049 1.258087
F  -6.594167 -2.033206 0.656304
F  -6.542235 2.176499 -1.370905
F  7.863326 -1.176571 -0.571139
F  7.783953 0.778732 -1.445441
F  7.146991 -0.935974 -2.582579
O  3.333177 -0.315241 -0.024928
O  5.87069 -0.272041 -0.989176
O  -2.776098 -0.225802 2.363855
O  -4.406911 0.193251 -1.408331
N  -2.217167 -0.038796 0.15596
N  -4.436234 -0.018397 0.858809
C  1.958899 -0.208749 0.037853
C  -0.825344 -0.106067 0.190326
C  4.05804 0.823843 -0.004295
C  1.308613 -0.399589 1.246752
C  1.209938 0.02485 -1.102476
C  -0.074027 -0.357992 1.336427
C  -0.166907 0.077296 -1.027568
C  5.545897 0.489886 0.126847
C  -6.513114 0.075129 -0.351664
C  -3.076123 -0.103442 1.194417
C  -5.021425 0.08452 -0.365576
C  -7.252704 -0.995347 0.131945
C  -7.225775 1.12503 -0.917301
C  -8.62975 -1.036595 0.069787
C  -8.601469 1.131056 -0.997844
C  -9.29527 0.037668 -0.500385
C  7.155922 -0.392356 -1.379371
H  1.699798 0.146894 -2.059051
H  -0.541803 -0.519421 2.293546
H  -0.737698 0.261939 -1.929356
H  6.132413 1.40921 0.204443
H  -2.632996 0.092814 -0.762034
H  -5.040635 -0.039363 1.671247
H  -9.167253 -1.893268 0.453391
H  -9.117835 1.972605 -1.439612
H  -10.374981 0.0233 -0.558224
elementType: Cl F O N C H
totalener: -2322.91845051 hartree
nucrepener: 3380.70345768 hartree
electener: -5703.62190820 hartree
oneelecener: -9929.47908735 hartree
twoeener: 4225.85717916 hartree
cpcmener: -0.03527422 hartree
kineticenergy: 2315.66376846 hartree
xcener: -181.037364813318 hartree
chargesum: -0.0000000
charge: -0.063451 -0.180607 -0.188137 -0.194263 -0.206045 -0.201311 -0.163195 -0.166668 -0.157248 -0.305075 -0.249366 -0.486518 -0.444389 -0.168152 -0.153766 0.158188 0.187038 0.477412 0.047138 -0.119818 -0.188571 -0.218090 0.210638 -0.132271 0.420933 0.401780 0.307264 0.303790 -0.241221 -0.241477 -0.064096 0.575452 0.152938 0.140694 0.143634 0.138809 0.199990 0.195323 0.153391 0.152185 0.167137
qa: -0.0635 -0.1806 -0.1881 -0.1943 -0.2060 -0.2013 -0.1632 -0.1667 -0.1572 -0.3051 -0.2494 -0.4865 -0.4444 -0.1682 -0.1538 0.1582 0.1870 0.4774 0.0471 -0.1198 -0.1886 -0.2181 0.2106 -0.1323 0.4209 0.4018 0.3073 0.3038 -0.2412 -0.2415 -0.0641 0.5755 0.1529 0.1407 0.1436 0.1388 0.2000 0.1953 0.1534 0.1522 0.1671
va: 1.2548 1.1260 1.1209 1.0927 1.0889 1.0983 1.1415 1.1397 1.1539 2.1196 2.1285 2.0256 2.0705 3.2501 3.2170 3.8309 3.8857 4.3188 4.0262 4.0250 4.0165 3.9819 4.1084 3.5484 4.3140 4.0770 3.9351 3.9558 3.9599 3.9592 3.8115 4.6390 1.0025 1.0516 1.0069 0.9946 1.0416 1.0069 1.0004 1.0010 0.9846
dispcorr: -0.018939285 hartree
energy: -2322.937389798507
dipole: -52.20416 48.70144 -3.50272 0.71912 -0.00175 0.71737 -1.70891 0.75661 -0.95230
magnitude: 3.70007 au
magnitude: 9.40484 debye
