program: Orca
programVersion: 5.0.2
elementType: Cl F F F F F F F F O O O O N N C C C C C C C C C C C C C C C C C H H H H H H H H H
charge: 0
multiplicity: 1
keywords: wb97x-d3
keywords: def2-TZVPP
keywords: def2/J RIJCOSX
keywords: DEFGRID2
keywords: scfconv7
keywords: smallprint printgap noloewdin
keywords: NOSOSCF
formula: C17H9ClF8N2O4
InChI: InChI=1/C17H9ClF8N2O4/c18-8-6-7(4-5-11(8)31-16(22,23)14(21)32-17(24,25)26)27-15(30)28-13(29)12-9(19)2-1-3-10(12)20/h1-6,14,27-28H
41 atoms
Cl 2.273615 -1.682569 1.014216
F  3.61361 1.345729 1.078005
F  4.03516 2.400832 -0.75003
F  6.270662 1.727897 0.555699
F  -6.723732 -0.204669 -2.100187
F  -6.113219 -0.180285 2.527003
F  7.800179 -0.811369 0.529377
F  6.487951 -1.869057 -0.795057
F  6.43129 -2.278628 1.314945
O  3.420552 0.25845 -0.862399
O  5.610673 -0.413726 0.642444
O  -2.803883 2.149152 -1.591237
O  -4.220211 -1.10704 0.52494
N  -2.127995 0.2339 -0.545207
N  -4.370131 0.850994 -0.630818
C  2.04409 0.298153 -0.799797
C  -0.741963 0.307127 -0.683384
C  4.109431 1.187895 -0.161959
C  1.376529 -0.578254 0.044935
C  1.312681 1.154278 -1.599818
C  -0.00274 -0.577089 0.104082
C  -0.071837 1.166503 -1.552746
C  5.576713 0.759141 -0.101157
C  -6.368597 -0.183657 0.208537
C  -3.038588 1.135782 -0.967166
C  -4.885894 -0.207963 0.051145
C  -7.242392 -0.203803 -0.868756
C  -6.93379 -0.210163 1.476542
C  -8.611993 -0.24406 -0.714024
C  -8.296168 -0.237178 1.682631
C  -9.128579 -0.257271 0.572815
C  6.577411 -1.323821 0.415257
H  1.820954 1.814151 -2.290226
H  -0.509694 -1.258452 0.775837
H  -0.603607 1.843167 -2.200175
H  5.985958 0.651773 -1.109689
H  -2.484859 -0.54031 0.008272
H  -5.011892 1.573907 -0.933109
H  -9.258969 -0.268595 -1.580399
H  -8.696675 -0.24264 2.687364
H  -10.200351 -0.284886 0.714026
elementType: Cl F O N C H
totalener: -2322.91857942 hartree
nucrepener: 3416.09732438 hartree
electener: -5739.01590380 hartree
twoeener: 4261.08408913 hartree
cpcmener: -0.03501178 hartree
kineticenergy: 2315.68144039 hartree
xcener: -181.040466144750 hartree
chargesum: -0.0000000
charge: -0.061966 -0.177512 -0.186506 -0.197013 -0.206147 -0.201372 -0.164881 -0.166539 -0.157998 -0.313167 -0.246758 -0.485659 -0.442951 -0.176905 -0.154421 0.143762 0.196964 0.459355 0.067343 -0.111163 -0.192237 -0.223790 0.221694 -0.131648 0.420674 0.399122 0.312294 0.300146 -0.243003 -0.240765 -0.063361 0.578162 0.151700 0.129176 0.155268 0.141710 0.201118 0.195556 0.152806 0.152365 0.166547
qa: -0.0620 -0.1775 -0.1865 -0.1970 -0.2061 -0.2014 -0.1649 -0.1665 -0.1580 -0.3132 -0.2468 -0.4857 -0.4430 -0.1769 -0.1544 0.1438 0.1970 0.4594 0.0673 -0.1112 -0.1922 -0.2238 0.2217 -0.1316 0.4207 0.3991 0.3123 0.3001 -0.2430 -0.2408 -0.0634 0.5782 0.1517 0.1292 0.1553 0.1417 0.2011 0.1956 0.1528 0.1524 0.1665
va: 1.2551 1.1259 1.1217 1.0868 1.0889 1.0981 1.1411 1.1378 1.1515 2.0991 2.1165 2.0254 2.0713 3.2432 3.2116 3.8268 3.8404 4.3521 4.0176 4.0372 4.0457 4.0076 4.0828 3.5470 4.3169 4.0823 3.9323 3.9598 3.9602 3.9620 3.8110 4.6365 1.0040 1.0271 1.0276 0.9955 1.0417 1.0067 1.0007 1.0008 0.9850
dispcorr: -0.019434064 hartree
energy: -2322.938013482484
dipole: -50.42946 46.90699 -3.52248 5.24111 -5.21886 0.02225 -7.25597 6.50924 -0.74674
magnitude: 3.60083 au
magnitude: 9.15258 debye
