program: Orca
programVersion: 5.0.2
elementType: Cl F F F F F F F F O O O O N N C C C C C C C C C C C C C C C C C H H H H H H H H H
charge: 0
multiplicity: 1
keywords: wb97x-d3
keywords: def2-TZVPP
keywords: def2/J RIJCOSX
keywords: DEFGRID2
keywords: scfconv7
keywords: smallprint printgap noloewdin
keywords: NOSOSCF
formula: C17H9ClF8N2O4
InChI: InChI=1/C17H9ClF8N2O4/c18-8-6-7(4-5-11(8)31-16(22,23)14(21)32-17(24,25)26)27-15(30)28-13(29)12-9(19)2-1-3-10(12)20/h1-6,14,27-28H
41 atoms
Cl 1.783177 -1.452027 2.295252
F  4.383665 1.657151 -0.783943
F  3.734687 -0.285612 -1.463905
F  5.187538 -1.528306 0.445669
F  -6.868992 2.195331 0.008595
F  -6.445382 -2.457124 0.085035
F  8.068074 -1.32057 -0.013935
F  8.017235 0.777611 0.420755
F  8.374523 0.10683 -1.591592
O  3.214546 0.368259 0.608691
O  6.383887 -0.09808 -0.811996
O  -2.743187 1.454444 -1.975143
O  -4.562566 -0.535926 1.154045
N  -2.310099 0.429764 0.020463
N  -4.478464 0.627779 -0.802222
C  1.864498 0.4205 0.35617
C  -0.91487 0.468429 0.070933
C  4.135547 0.393583 -0.376505
C  1.061046 -0.398318 1.139795
C  1.26824 1.267271 -0.560886
C  -0.312651 -0.372552 1.006175
C  -0.109934 1.293076 -0.711447
C  5.424772 -0.214085 0.185992
C  -6.601471 -0.127363 0.042658
C  -3.106327 0.875749 -0.972549
C  -5.121051 -0.03167 0.19985
C  -7.431219 0.983169 -0.022142
C  -7.219004 -1.372133 0.038605
C  -8.804812 0.882082 -0.09136
C  -8.586311 -1.524018 -0.038815
C  -9.372567 -0.382862 -0.100881
C  7.691987 -0.136516 -0.488295
H  1.859844 1.941322 -1.164558
H  -0.919208 -1.019022 1.628136
H  -0.533997 1.974434 -1.43012
H  5.70729 0.285572 1.11661
H  -2.769998 -0.082574 0.767988
H  -5.034563 0.958227 -1.581194
H  -9.415834 1.77352 -0.131131
H  -9.025368 -2.512468 -0.050765
H  -10.4479 -0.481818 -0.157099
elementType: Cl F O N C H
totalener: -2322.91682797 hartree
nucrepener: 3352.47878088 hartree
electener: -5675.39560885 hartree
oneelecener: -9872.56216925 hartree
twoeener: 4197.16656040 hartree
cpcmener: -0.03422299 hartree
kineticenergy: 2315.65844884 hartree
xcener: -181.037674290432 hartree
chargesum: -0.0000000
charge: -0.064351 -0.186590 -0.179902 -0.196193 -0.206163 -0.201286 -0.163266 -0.165683 -0.156799 -0.300170 -0.250500 -0.487022 -0.443968 -0.179734 -0.154733 0.175493 0.171693 0.481863 0.035123 -0.128299 -0.164813 -0.210731 0.216367 -0.133214 0.420443 0.399178 0.312115 0.299838 -0.242318 -0.239646 -0.063886 0.577366 0.146648 0.125693 0.154989 0.135217 0.200202 0.195389 0.152574 0.152480 0.166595
qa: -0.0644 -0.1866 -0.1799 -0.1962 -0.2062 -0.2013 -0.1633 -0.1657 -0.1568 -0.3002 -0.2505 -0.4870 -0.4440 -0.1797 -0.1547 0.1755 0.1717 0.4819 0.0351 -0.1283 -0.1648 -0.2107 0.2164 -0.1332 0.4204 0.3992 0.3121 0.2998 -0.2423 -0.2396 -0.0639 0.5774 0.1466 0.1257 0.1550 0.1352 0.2002 0.1954 0.1526 0.1525 0.1666
va: 1.2499 1.1180 1.1296 1.0869 1.0888 1.0981 1.1420 1.1398 1.1545 2.1289 2.1266 2.0247 2.0701 3.2394 3.2128 3.8511 3.8661 4.3165 4.0082 4.0222 4.0404 4.0141 4.1165 3.5475 4.3190 4.0830 3.9322 3.9592 3.9581 3.9602 3.8107 4.6377 1.0185 1.0287 1.0261 0.9984 1.0427 1.0069 1.0008 1.0007 0.9850
dispcorr: -0.018753688 hartree
energy: -2322.935581654103
dipole: -53.73885 50.20510 -3.53375 5.42273 -4.90725 0.51548 -1.36242 1.64909 0.28667
magnitude: 3.58264 au
magnitude: 9.10634 debye
