program: Orca
programVersion: 5.0.2
elementType: Cl F F F F F F F F O O O O N N C C C C C C C C C C C C C C C C C H H H H H H H H H
charge: 0
multiplicity: 1
keywords: wb97x-d3
keywords: def2-TZVPP
keywords: def2/J RIJCOSX
keywords: DEFGRID2
keywords: scfconv7
keywords: smallprint printgap noloewdin
keywords: NOSOSCF
formula: C17H9ClF8N2O4
InChI: InChI=1/C17H9ClF8N2O4/c18-8-6-7(4-5-11(8)31-16(22,23)14(21)32-17(24,25)26)27-15(30)28-13(29)12-9(19)2-1-3-10(12)20/h1-6,14,27-28H
41 atoms
Cl 2.095169 0.867874 2.723188
F  4.16163 0.501829 -1.903021
F  3.676615 -1.323407 -0.852135
F  5.359877 -0.708854 1.161524
F  -6.523657 -2.390829 -1.021205
F  -6.776261 2.066131 0.33433
F  8.152414 -0.649034 0.416633
F  7.911875 0.916907 -1.026204
F  8.256738 -1.101422 -1.685514
O  3.216473 0.640766 0.110202
O  6.328918 -0.639507 -0.863551
O  -2.894321 0.347485 2.374253
O  -4.497397 -0.218004 -1.394459
N  -2.320097 0.145821 0.171614
N  -4.541127 0.083729 0.863451
C  1.856434 0.458809 0.073193
C  -0.929771 0.250365 0.213844
C  4.069104 -0.050498 -0.67461
C  1.189929 0.580524 1.283878
C  1.1177 0.227649 -1.076442
C  -0.189578 0.491283 1.368376
C  -0.256983 0.115754 -1.001126
C  5.444234 -0.006939 -0.00077
C  -6.606507 -0.164549 -0.331587
C  -3.184739 0.203262 1.204641
C  -5.115383 -0.098977 -0.355531
C  -7.264823 -1.325495 -0.709929
C  -7.392523 0.931026 -0.009266
C  -8.639339 -1.417028 -0.752429
C  -8.770417 0.893763 -0.051702
C  -9.383756 -0.293374 -0.422886
C  7.645767 -0.363099 -0.779222
H  1.588404 0.146572 -2.046322
H  -0.661745 0.606016 2.32998
H  -0.814964 -0.068831 -1.911066
H  5.725459 1.025011 0.226364
H  -2.727808 -0.003147 -0.747232
H  -5.153115 0.118037 1.669999
H  -9.117125 -2.344238 -1.038569
H  -9.349279 1.773079 0.196282
H  -10.463372 -0.344009 -0.458183
elementType: Cl F O N C H
totalener: -2322.91706489 hartree
nucrepener: 3350.95719149 hartree
electener: -5673.87425638 hartree
oneelecener: -9869.50155340 hartree
twoeener: 4195.62729702 hartree
cpcmener: -0.03443630 hartree
kineticenergy: 2315.66500475 hartree
xcener: -181.038962297530 hartree
chargesum: -0.0000000
charge: -0.067594 -0.186673 -0.180710 -0.196346 -0.202619 -0.206294 -0.163326 -0.166003 -0.155908 -0.298353 -0.251304 -0.488116 -0.442926 -0.168414 -0.151906 0.178138 0.170030 0.488634 0.032015 -0.127824 -0.169604 -0.218015 0.212232 -0.129944 0.420169 0.393869 0.307402 0.313471 -0.247009 -0.245813 -0.064435 0.577575 0.146633 0.139650 0.144244 0.136487 0.199222 0.196861 0.152700 0.152912 0.166897
qa: -0.0676 -0.1867 -0.1807 -0.1963 -0.2026 -0.2063 -0.1633 -0.1660 -0.1559 -0.2984 -0.2513 -0.4881 -0.4429 -0.1684 -0.1519 0.1781 0.1700 0.4886 0.0320 -0.1278 -0.1696 -0.2180 0.2122 -0.1299 0.4202 0.3939 0.3074 0.3135 -0.2470 -0.2458 -0.0644 0.5776 0.1466 0.1396 0.1442 0.1365 0.1992 0.1969 0.1527 0.1529 0.1669
va: 1.2480 1.1180 1.1304 1.0863 1.0968 1.0882 1.1422 1.1390 1.1553 2.1328 2.1241 2.0244 2.0718 3.2524 3.2141 3.8558 3.9167 4.3057 4.0112 4.0035 4.0098 3.9976 4.1192 3.5471 4.3130 4.0818 3.9585 3.9371 3.9643 3.9636 3.8081 4.6375 1.0188 1.0532 1.0072 0.9976 1.0422 1.0051 1.0008 1.0006 0.9847
dispcorr: -0.018769031 hartree
energy: -2322.935833919504
dipole: -54.31462 50.73720 -3.57741 2.17746 -1.70534 0.47212 -1.07456 0.25878 -0.81578
magnitude: 3.69950 au
magnitude: 9.40337 debye
