program: Orca
programVersion: 5.0.2
elementType: Cl F F F F F F F F O O O O N N C C C C C C C C C C C C C C C C C H H H H H H H H H
charge: 0
multiplicity: 1
keywords: wb97x-d3
keywords: def2-TZVPP
keywords: def2/J RIJCOSX
keywords: DEFGRID2
keywords: scfconv7
keywords: smallprint printgap noloewdin
keywords: NOSOSCF
formula: C17H9ClF8N2O4
InChI: InChI=1/C17H9ClF8N2O4/c18-8-6-7(4-5-11(8)31-16(22,23)14(21)32-17(24,25)26)27-15(30)28-13(29)12-9(19)2-1-3-10(12)20/h1-6,14,27-28H
41 atoms
Cl 2.565685 -2.040913 -0.707488
F  3.662402 1.689011 1.098424
F  4.247716 2.749529 -0.687994
F  6.411633 1.79821 0.483043
F  -6.507264 -1.351616 -1.597228
F  -6.406458 1.780897 1.865645
F  5.912476 -1.942825 -0.546869
F  6.000624 -2.094508 1.597284
F  7.509383 -0.993016 0.520635
O  3.380493 0.710016 -0.892738
O  5.437914 -0.203752 0.760389
O  -2.411262 -2.139352 0.141362
O  -4.425097 1.44919 -0.206685
N  -2.097956 0.094957 -0.220178
N  -4.216553 -0.793522 0.132698
C  2.030778 0.596235 -0.671212
C  -0.713575 0.18622 -0.357315
C  4.158043 1.520523 -0.137925
C  1.506182 -0.685143 -0.597701
C  1.172643 1.680409 -0.585533
C  0.145332 -0.905193 -0.454558
C  -0.182074 1.475567 -0.420099
C  5.557623 0.8990 -0.076514
C  -6.401999 0.2114 0.135523
C  -2.834676 -1.008485 0.017793
C  -4.925627 0.360466 -0.002169
C  -7.152918 -0.614984 -0.688928
C  -7.102332 0.983783 1.053942
C  -8.528369 -0.684232 -0.622106
C  -8.474759 0.936494 1.169818
C  -9.180344 0.098708 0.31816
C  6.212429 -1.289685 0.572101
H  1.544349 2.693727 -0.656478
H  -0.22046 -1.918106 -0.420152
H  -0.837726 2.334062 -0.34476
H  5.912717 0.655338 -1.08209
H  -2.608631 0.972689 -0.268539
H  -4.727226 -1.639477 0.352985
H  -9.07586 -1.331047 -1.294367
H  -8.98096 1.542913 1.908712
H  -10.258655 0.056515 0.388514
elementType: Cl F O N C H
totalener: -2322.91666277 hartree
nucrepener: 3427.01777168 hartree
electener: -5749.93443445 hartree
twoeener: 4271.97069513 hartree
cpcmener: -0.03474054 hartree
kineticenergy: 2315.66596310 hartree
xcener: -181.039557922352 hartree
chargesum: -0.0000000
charge: -0.070968 -0.179839 -0.186452 -0.198055 -0.206247 -0.200914 -0.165008 -0.157690 -0.165168 -0.309904 -0.253449 -0.488925 -0.444575 -0.172874 -0.154233 0.169453 0.177717 0.484460 0.048488 -0.121980 -0.185141 -0.214305 0.216235 -0.132482 0.421345 0.402416 0.310339 0.299087 -0.241359 -0.239668 -0.062861 0.579429 0.151358 0.140212 0.143770 0.140253 0.201195 0.193793 0.153116 0.152738 0.166693
qa: -0.0710 -0.1798 -0.1865 -0.1981 -0.2062 -0.2009 -0.1650 -0.1577 -0.1652 -0.3099 -0.2534 -0.4889 -0.4446 -0.1729 -0.1542 0.1695 0.1777 0.4845 0.0485 -0.1220 -0.1851 -0.2143 0.2162 -0.1325 0.4213 0.4024 0.3103 0.2991 -0.2414 -0.2397 -0.0629 0.5794 0.1514 0.1402 0.1438 0.1403 0.2012 0.1938 0.1531 0.1527 0.1667
va: 1.2496 1.1290 1.1178 1.0857 1.0889 1.0988 1.1369 1.1519 1.1409 2.1140 2.1122 2.0234 2.0700 3.2483 3.2184 3.8291 3.8917 4.3109 4.0301 4.0120 4.0336 3.9913 4.1168 3.5487 4.3151 4.0781 3.9311 3.9594 3.9613 3.9571 3.8118 4.6356 1.0126 1.0503 1.0076 0.9962 1.0416 1.0083 1.0006 1.0007 0.9849
dispcorr: -0.019683156 hartree
energy: -2322.936345923276
dipole: -50.20132 46.55430 -3.64702 4.37307 -3.79975 0.57332 -2.91223 2.43450 -0.47772
magnitude: 3.72259 au
magnitude: 9.46206 debye
