program: Orca
programVersion: 5.0.2
elementType: Cl F F F F F F F F O O O O N N C C C C C C C C C C C C C C C C C H H H H H H H H H
charge: 0
multiplicity: 1
keywords: wb97x-d3
keywords: def2-TZVPP
keywords: def2/J RIJCOSX
keywords: DEFGRID2
keywords: scfconv7
keywords: smallprint printgap noloewdin
keywords: NOSOSCF
formula: C17H9ClF8N2O4
InChI: InChI=1/C17H9ClF8N2O4/c18-8-6-7(4-5-11(8)31-16(22,23)14(21)32-17(24,25)26)27-15(30)28-13(29)12-9(19)2-1-3-10(12)20/h1-6,14,27-28H
41 atoms
Cl 2.359734 1.92863 -2.641152
F  4.605262 1.054639 1.774869
F  5.694215 1.565676 -0.019314
F  4.271398 -0.364602 -1.40999
F  -5.579255 -1.860476 -1.487991
F  -6.390605 0.591389 2.39782
F  6.71959 -2.785784 0.726236
F  4.934023 -3.049029 -0.455028
F  4.778727 -2.667276 1.650099
O  3.581058 1.931437 -0.004796
O  5.526145 -1.046384 0.320154
O  -2.616362 1.596496 -1.881195
O  -3.820865 -0.491957 1.477436
N  -1.836378 0.690769 0.062321
N  -4.076771 0.523609 -0.546586
C  2.249961 1.583861 0.029898
C  -0.482926 1.022252 -0.008754
C  4.534564 1.07045 0.425235
C  1.544558 1.576777 -1.165687
C  1.57763 1.319392 1.212706
C  0.187204 1.301504 -1.197162
C  0.226858 1.033293 1.191418
C  4.365209 -0.380096 -0.052841
C  -5.944308 -0.605605 0.447089
C  -2.787671 0.982511 -0.848843
C  -4.511707 -0.198791 0.522486
C  -6.43322 -1.434508 -0.552359
C  -6.839559 -0.209566 1.430683
C  -7.74812 -1.846362 -0.598613
C  -8.164302 -0.589502 1.424459
C  -8.608031 -1.411917 0.398971
C  5.476904 -2.37356 0.555052
H  2.094558 1.351365 2.161803
H  -0.320847 1.29074 -2.147869
H  -0.283759 0.827441 2.124035
H  3.459137 -0.83398 0.357995
H  -2.148061 0.248048 0.921815
H  -4.758171 0.776928 -1.25222
H  -8.09009 -2.494844 -1.3939
H  -8.834007 -0.249472 2.202848
H  -9.643845 -1.721886 0.378512
elementType: Cl F O N C H
totalener: -2322.91525794 hartree
nucrepener: 3440.10455535 hartree
electener: -5763.01981329 hartree
twoeener: 4284.23006890 hartree
cpcmener: -0.03713929 hartree
kineticenergy: 2315.66032896 hartree
xcener: -181.037097064265 hartree
chargesum: 0.0000000
charge: -0.061938 -0.184943 -0.169730 -0.193271 -0.206050 -0.201534 -0.155228 -0.163756 -0.165653 -0.278892 -0.254982 -0.485379 -0.442694 -0.183187 -0.157273 0.096076 0.185661 0.444335 0.061981 -0.105252 -0.175250 -0.199523 0.206248 -0.128341 0.420004 0.396948 0.305093 0.306809 -0.241294 -0.245141 -0.063084 0.577376 0.158669 0.131888 0.145703 0.153139 0.202235 0.197547 0.153253 0.152658 0.166771
qa: -0.0619 -0.1849 -0.1697 -0.1933 -0.2060 -0.2015 -0.1552 -0.1638 -0.1657 -0.2789 -0.2550 -0.4854 -0.4427 -0.1832 -0.1573 0.0961 0.1857 0.4443 0.0620 -0.1053 -0.1753 -0.1995 0.2062 -0.1283 0.4200 0.3969 0.3051 0.3068 -0.2413 -0.2451 -0.0631 0.5774 0.1587 0.1319 0.1457 0.1531 0.2022 0.1975 0.1533 0.1527 0.1668
va: 1.2529 1.1145 1.1394 1.0905 1.0888 1.0981 1.1557 1.1423 1.1395 2.0995 2.1194 2.0250 2.0696 3.2336 3.2055 3.8861 3.8337 4.4412 4.0127 3.9705 4.0697 4.0038 4.0520 3.5425 4.3213 4.0858 3.9366 3.9563 3.9613 3.9625 3.8099 4.6366 1.0089 1.0462 1.0056 0.9852 1.0395 1.0050 1.0003 1.0009 0.9847
dispcorr: -0.019825791 hartree
energy: -2322.935083729590
dipole: -47.55705 43.25574 -4.30131 3.64701 -4.85249 -1.20548 3.74364 -2.58187 1.16177
magnitude: 4.61564 au
magnitude: 11.73203 debye
