program: Orca
programVersion: 5.0.2
elementType: Cl F F F F F F F F O O O O N N C C C C C C C C C C C C C C C C C H H H H H H H H H
charge: 0
multiplicity: 1
keywords: wb97x-d3
keywords: def2-TZVPP
keywords: def2/J RIJCOSX
keywords: DEFGRID2
keywords: scfconv7
keywords: smallprint printgap noloewdin
keywords: NOSOSCF
formula: C17H9ClF8N2O4
InChI: InChI=1/C17H9ClF8N2O4/c18-8-6-7(4-5-11(8)31-16(22,23)14(21)32-17(24,25)26)27-15(30)28-13(29)12-9(19)2-1-3-10(12)20/h1-6,14,27-28H
41 atoms
Cl 2.097777 -2.141945 -2.377967
F  4.799159 1.863905 -0.916784
F  5.625816 0.042413 -1.727879
F  4.138315 -1.422124 0.101081
F  -6.533761 -1.078664 -1.736057
F  -5.626019 0.523609 2.560485
F  7.019083 0.183618 2.536916
F  5.255543 -1.021233 2.812733
F  5.092807 1.114338 2.768066
O  3.516242 0.360841 -1.946714
O  5.647615 0.043412 0.894845
O  -2.28165 2.454053 0.349312
O  -4.023591 -1.203259 -0.436811
N  -1.836972 0.369364 -0.474731
N  -3.96677 0.968202 0.241476
C  2.214287 0.408998 -1.505386
C  -0.482045 0.454194 -0.788085
C  4.555971 0.546939 -1.102703
C  1.421856 -0.717907 -1.688469
C  1.64825 1.553576 -0.975412
C  0.086848 -0.695531 -1.338935
C  0.313823 1.584029 -0.605157
C  4.40826 -0.100642 0.283728
C  -6.023564 -0.270713 0.395565
C  -2.625901 1.330421 0.047896
C  -4.580102 -0.228498 0.029753
C  -6.957211 -0.7497 -0.516215
C  -6.500389 0.079224 1.65237
C  -8.297253 -0.866371 -0.216978
C  -7.829084 -0.033544 2.002424
C  -8.72238 -0.506851 1.053344
C  5.737862 0.077073 2.239562
H  2.243257 2.4485 -0.851003
H  -0.519378 -1.579294 -1.495729
H  -0.085666 2.494213 -0.191355
H  3.593692 0.349056 0.858081
H  -2.288696 -0.518921 -0.674648
H  -4.530143 1.73735 0.580777
H  -8.992016 -1.228929 -0.962589
H  -8.155752 0.239392 2.996677
H  -9.769423 -0.5975 1.308124
elementType: Cl F O N C H
totalener: -2322.91515669 hartree
nucrepener: 3434.72498507 hartree
electener: -5757.64014176 hartree
twoeener: 4278.83875299 hartree
cpcmener: -0.03550185 hartree
kineticenergy: 2315.67739612 hartree
xcener: -181.042202337307 hartree
chargesum: -0.0000000
charge: -0.059028 -0.185488 -0.170667 -0.193626 -0.199592 -0.206320 -0.155901 -0.163390 -0.165918 -0.278164 -0.253463 -0.487494 -0.445961 -0.172183 -0.152743 0.109590 0.179475 0.440981 0.053241 -0.130012 -0.178344 -0.192245 0.207256 -0.132713 0.421345 0.404093 0.299387 0.308427 -0.237685 -0.240517 -0.061710 0.577647 0.158565 0.127506 0.160142 0.152551 0.199341 0.191072 0.152606 0.152778 0.167160
qa: -0.0590 -0.1855 -0.1707 -0.1936 -0.1996 -0.2063 -0.1559 -0.1634 -0.1659 -0.2782 -0.2535 -0.4875 -0.4460 -0.1722 -0.1527 0.1096 0.1795 0.4410 0.0532 -0.1300 -0.1783 -0.1922 0.2073 -0.1327 0.4213 0.4041 0.2994 0.3084 -0.2377 -0.2405 -0.0617 0.5776 0.1586 0.1275 0.1601 0.1526 0.1993 0.1911 0.1526 0.1528 0.1672
va: 1.2562 1.1124 1.1366 1.0905 1.0998 1.0890 1.1551 1.1426 1.1397 2.1015 2.1203 2.0246 2.0674 3.2544 3.2211 3.8754 3.8995 4.4412 4.0130 3.9994 4.0287 3.9708 4.0567 3.5471 4.3149 4.0745 3.9568 3.9310 3.9570 3.9597 3.8120 4.6383 1.0108 1.0286 1.0288 0.9859 1.0441 1.0106 1.0009 1.0009 0.9846
dispcorr: -0.019703148 hartree
energy: -2322.934859840824
dipole: -47.86286 43.48295 -4.37991 5.85267 -5.38716 0.46551 -1.28110 2.39392 1.11281
magnitude: 4.54298 au
magnitude: 11.54734 debye
