program: Orca
programVersion: 5.0.2
elementType: Cl F F F F F F F F O O O O N N C C C C C C C C C C C C C C C C C H H H H H H H H H
charge: 0
multiplicity: 1
keywords: wb97x-d3
keywords: def2-TZVPP
keywords: def2/J RIJCOSX
keywords: DEFGRID2
keywords: scfconv7
keywords: smallprint printgap noloewdin
keywords: NOSOSCF
formula: C17H9ClF8N2O4
InChI: InChI=1/C17H9ClF8N2O4/c18-8-6-7(4-5-11(8)31-16(22,23)14(21)32-17(24,25)26)27-15(30)28-13(29)12-9(19)2-1-3-10(12)20/h1-6,14,27-28H
41 atoms
Cl 2.159613 -0.056825 2.73736
F  3.904175 -0.291573 -1.685922
F  3.595107 -1.417307 0.125515
F  5.546785 0.03441 1.394627
F  -6.222198 -2.278093 -0.585639
F  -6.997805 2.296393 -0.195689
F  8.007872 -1.708659 -1.428535
F  8.231574 -0.123511 0.012866
F  7.419904 0.303036 -1.922492
O  3.231419 0.786074 0.14519
O  6.225141 -0.930877 -0.511594
O  -2.829663 -0.506633 2.269971
O  -4.514451 0.730066 -1.305936
N  -2.300176 0.31946 0.200168
N  -4.499839 -0.124281 0.808269
C  1.865336 0.626781 0.155453
C  -0.909198 0.400337 0.251485
C  3.988616 -0.225925 -0.339014
C  1.228114 0.24942 1.327857
C  1.109491 0.897375 -0.970817
C  -0.151275 0.13694 1.389581
C  -0.265063 0.785568 -0.924771
C  5.439583 0.068065 0.046717
C  -6.572187 0.013522 -0.380064
C  -3.13423 -0.122824 1.168288
C  -5.095218 0.251525 -0.358785
C  -7.086555 -1.264784 -0.523514
C  -7.475606 1.063216 -0.338654
C  -8.440785 -1.513682 -0.610213
C  -8.838963 0.862586 -0.415587
C  -9.309696 -0.434735 -0.553272
C  7.457584 -0.612407 -0.952294
H  1.595621 1.209571 -1.884471
H  -0.615513 -0.158658 2.315772
H  -0.8428 0.997678 -1.81574
H  5.713374 1.068569 -0.303655
H  -2.741496 0.614402 -0.66479
H  -5.089011 -0.479722 1.546518
H  -8.801619 -2.526072 -0.724474
H  -9.513866 1.705641 -0.370009
H  -10.374794 -0.608014 -0.617989
totalener: -2322.89485982 hartree
nucrepener: 3374.79620724 hartree
electener: -5697.69106706 hartree
oneelecener: -9917.07944184 hartree
twoeener: 4219.38837478 hartree
kineticenergy: 2315.76968161 hartree
xcener: -181.049121602258 hartree
chargesum: 0.0000000
charge: -0.038437 -0.182011 -0.161278 -0.170021 -0.186386 -0.181112 -0.144817 -0.157574 -0.168104 -0.307977 -0.239015 -0.397616 -0.371302 -0.189190 -0.172591 0.137522 0.184214 0.467303 0.063951 -0.102963 -0.176948 -0.201101 0.205477 -0.159701 0.391933 0.371040 0.282530 0.311779 -0.228951 -0.234715 -0.041290 0.564890 0.126297 0.146566 0.113423 0.095495 0.176598 0.170466 0.133542 0.131612 0.138463
qa: -0.0384 -0.1820 -0.1613 -0.1700 -0.1864 -0.1811 -0.1448 -0.1576 -0.1681 -0.3080 -0.2390 -0.3976 -0.3713 -0.1892 -0.1726 0.1375 0.1842 0.4673 0.0640 -0.1030 -0.1769 -0.2011 0.2055 -0.1597 0.3919 0.3710 0.2825 0.3118 -0.2290 -0.2347 -0.0413 0.5649 0.1263 0.1466 0.1134 0.0955 0.1766 0.1705 0.1335 0.1316 0.1385
va: 1.2813 1.1263 1.1524 1.1216 1.1128 1.1266 1.1709 1.1506 1.1344 2.1127 2.1260 2.1125 2.1400 3.2532 3.1978 3.8856 3.9192 4.3223 4.0573 4.0914 4.0272 4.0281 4.1335 3.5761 4.3134 4.0945 3.9971 3.9993 4.0032 4.0022 3.8448 4.6455 1.0134 1.0477 1.0163 1.0078 1.0687 1.0239 1.0077 1.0089 0.9954
dispcorr: -0.019047469 hartree
energy: -2322.913907283853
dipole: -53.44095 50.43344 -3.00752 4.71970 -4.29821 0.42148 -2.04631 1.30368 -0.74263
magnitude: 3.12639 au
magnitude: 7.94665 debye
