program: Orca
programVersion: 5.0.2
elementType: Cl F F F F F F F F O O O O N N C C C C C C C C C C C C C C C C C H H H H H H H H H
charge: 0
multiplicity: 1
keywords: wb97x-d3
keywords: def2-TZVPP
keywords: def2/J RIJCOSX
keywords: DEFGRID2
keywords: scfconv7
keywords: smallprint printgap noloewdin
keywords: NOSOSCF
formula: C17H9ClF8N2O4
InChI: InChI=1/C17H9ClF8N2O4/c18-8-6-7(4-5-11(8)31-16(22,23)14(21)32-17(24,25)26)27-15(30)28-13(29)12-9(19)2-1-3-10(12)20/h1-6,14,27-28H
41 atoms
Cl 2.571538 -1.982766 0.132904
F  3.616948 1.208433 1.463161
F  4.028815 2.71113 -0.026999
F  6.322924 1.726537 0.916942
F  -6.534869 -1.360642 -1.627336
F  -6.443085 1.831555 1.773574
F  6.194559 -1.416818 -1.255916
F  6.196659 -2.423081 0.64904
F  7.700388 -0.951225 0.193878
O  3.39154 0.685061 -0.697067
O  5.591524 -0.366728 0.609782
O  -2.444196 -2.066488 0.399993
O  -4.463951 1.453632 -0.413195
N  -2.11621 0.107842 -0.242571
N  -4.245958 -0.737163 0.1743
C  2.030536 0.5594 -0.550466
C  -0.72639 0.189353 -0.336529
C  4.093692 1.385301 0.225919
C  1.507157 -0.67205 -0.186761
C  1.167208 1.607742 -0.816213
C  0.139545 -0.872401 -0.086976
C  -0.197016 1.426509 -0.70651
C  5.555626 0.931783 0.130934
C  -6.436177 0.242141 0.066029
C  -2.853417 -0.966878 0.120734
C  -4.956631 0.395915 -0.090709
C  -7.182592 -0.606484 -0.737996
C  -7.134248 1.023043 0.977564
C  -8.557553 -0.689753 -0.658656
C  -8.50718 0.962644 1.101479
C  -9.210769 0.103895 0.270795
C  6.415859 -1.27213 0.049743
H  1.557865 2.568455 -1.120924
H  -0.232468 -1.843975 0.192811
H  -0.857672 2.259349 -0.913078
H  5.903182 1.020594 -0.903422
H  -2.637099 0.957951 -0.43227
H  -4.753017 -1.561724 0.459417
H  -9.099163 -1.357498 -1.313712
H  -9.010888 1.577989 1.833488
H  -10.2876 0.051221 0.350753
totalener: -2322.89458389 hartree
nucrepener: 3429.67999015 hartree
electener: -5752.57457404 hartree
twoeener: 4274.38201288 hartree
kineticenergy: 2315.73411699 hartree
xcener: -181.044376145839 hartree
chargesum: 0.0000000
charge: -0.048016 -0.162219 -0.182246 -0.176111 -0.187821 -0.177848 -0.166661 -0.148776 -0.160395 -0.309371 -0.235916 -0.399493 -0.373807 -0.189121 -0.175295 0.129931 0.184047 0.454603 0.089780 -0.094825 -0.194285 -0.202270 0.209607 -0.156953 0.394590 0.377825 0.279496 0.295911 -0.224811 -0.223401 -0.042813 0.573023 0.129157 0.148903 0.113471 0.101118 0.177277 0.170054 0.133075 0.131920 0.138667
qa: -0.0480 -0.1622 -0.1822 -0.1761 -0.1878 -0.1778 -0.1667 -0.1488 -0.1604 -0.3094 -0.2359 -0.3995 -0.3738 -0.1891 -0.1753 0.1299 0.1840 0.4546 0.0898 -0.0948 -0.1943 -0.2023 0.2096 -0.1570 0.3946 0.3778 0.2795 0.2959 -0.2248 -0.2234 -0.0428 0.5730 0.1292 0.1489 0.1135 0.1011 0.1773 0.1701 0.1331 0.1319 0.1387
va: 1.2716 1.1474 1.1252 1.1150 1.1104 1.1323 1.1372 1.1661 1.1485 2.1054 2.1220 2.1101 2.1392 3.2572 3.2032 3.8722 3.9282 4.3437 4.0389 4.0907 4.0370 4.0284 4.1389 3.5774 4.3125 4.0897 3.9855 4.0062 3.9960 3.9943 3.8483 4.6370 1.0150 1.0464 1.0163 1.0074 1.0673 1.0259 1.0082 1.0087 0.9956
dispcorr: -0.019763432 hartree
energy: -2322.914347326547
dipole: -50.59369 47.54367 -3.05001 4.86546 -4.43686 0.42860 -3.83377 3.33247 -0.50129
magnitude: 3.12051 au
magnitude: 7.93171 debye
