program: Orca
programVersion: 5.0.2
elementType: Cl Cl F F F F F F F F O O O N N C C C C C C C C C C C C C C C C C H H H H H H H H
charge: 0
multiplicity: 1
keywords: wb97x-d3
keywords: def2-TZVPP
keywords: def2/J RIJCOSX
keywords: DEFGRID2
keywords: scfconv7
keywords: smallprint printgap noloewdin
keywords: NOSOSCF
formula: C17H8Cl2F8N2O3
InChI: InChI=1/C17H8Cl2F8N2O3/c18-6-5-11(32-17(26,27)14(22)16(23,24)25)7(19)4-10(6)28-15(31)29-13(30)12-8(20)2-1-3-9(12)21/h1-5,14,28-29H
40 atoms
Cl 2.283737 1.549167 2.560504
Cl -0.287638 -0.684052 -2.620436
F  6.642181 -1.269521 1.00055
F  4.030243 -0.977325 1.828479
F  4.290094 -1.605555 -0.198471
F  7.814957 0.51197 -0.503306
F  6.039152 1.700039 -0.760425
F  6.175627 -0.25151 -1.663335
F  -5.95608 -1.628291 1.623819
F  -6.407405 1.81323 -1.509294
O  3.729489 0.522966 0.203928
O  -2.009654 -2.004057 -0.403086
O  -4.191514 1.425808 0.243038
N  -1.804483 0.24541 -0.166255
N  -3.898111 -0.773967 -0.27115
C  5.921208 -0.13994 0.710774
C  4.449359 -0.54878 0.622199
C  2.361449 0.39758 0.120536
C  -0.406084 0.260768 -0.08429
C  6.487036 0.459394 -0.579287
C  1.566355 0.859037 1.160448
C  1.784117 -0.106203 -1.029314
C  0.404738 -0.157905 -1.13741
C  0.190415 0.77968 1.056871
C  -2.504456 -0.901781 -0.281981
C  -6.122568 0.086551 0.039383
C  -4.651879 0.321225 0.02312
C  -6.731702 -0.864586 0.847731
C  -6.962214 0.888734 -0.72444
C  -8.099077 -1.032819 0.897257
C  -8.332691 0.747856 -0.7198
C  -8.891976 -0.220376 0.101174
H  6.045365 0.588956 1.51716
H  2.409675 -0.414193 -1.856059
H  -0.436494 1.122354 1.869286
H  -2.308832 1.09148 0.079653
H  -4.378733 -1.646189 -0.454528
H  -8.533221 -1.779533 1.547785
H  -8.948183 1.381519 -1.343508
H  -9.96601 -0.340777 0.123336
elementType: Cl F O N C H
totalener: -2707.26856534 hartree
nucrepener: 3642.78647571 hartree
electener: -6350.05504105 hartree
twoeener: 4634.88413440 hartree
cpcmener: -0.04374040 hartree
kineticenergy: 2699.66277710 hartree
xcener: -195.741315469685 hartree
chargesum: 0.0000000
charge: -0.054180 -0.056643 -0.207903 -0.178961 -0.183713 -0.163691 -0.162348 -0.165764 -0.208028 -0.203229 -0.321032 -0.500725 -0.465655 -0.220355 -0.153642 0.131624 0.460015 0.194936 0.191059 0.464686 0.041555 -0.095647 -0.024972 -0.187868 0.416108 -0.136932 0.423630 0.314000 0.297496 -0.241873 -0.238731 -0.064772 0.131274 0.140697 0.137755 0.213186 0.199473 0.155512 0.153745 0.169912
qa: -0.0542 -0.0566 -0.2079 -0.1790 -0.1837 -0.1637 -0.1623 -0.1658 -0.2080 -0.2032 -0.3210 -0.5007 -0.4657 -0.2204 -0.1536 0.1316 0.4600 0.1949 0.1911 0.4647 0.0416 -0.0956 -0.0250 -0.1879 0.4161 -0.1369 0.4236 0.3140 0.2975 -0.2419 -0.2387 -0.0648 0.1313 0.1407 0.1378 0.2132 0.1995 0.1555 0.1537 0.1699
va: 1.2573 1.2616 1.0796 1.1258 1.1243 1.1489 1.1480 1.1477 1.0870 1.0949 2.0933 2.0117 2.0401 3.1493 3.2125 3.9649 4.3496 3.8582 3.6638 4.4582 4.0317 4.0580 4.0277 4.1740 4.3439 3.5442 4.0654 3.9258 3.9542 3.9552 3.9541 3.8096 1.0100 1.0172 1.0220 1.0313 1.0042 0.9997 1.0002 0.9836
dispcorr: -0.020575834 hartree
energy: -2707.289141170820
dipole: -48.21457 44.95697 -3.25760 0.41961 0.33168 0.75129 1.65250 -1.10625 0.54624
magnitude: 3.38745 au
magnitude: 8.61020 debye
