program: Orca
programVersion: 5.0.2
elementType: Cl Cl F F F F F F F F O O O N N C C C C C C C C C C C C C C C C C H H H H H H H H
charge: 0
multiplicity: 1
keywords: wb97x-d3
keywords: def2-TZVPP
keywords: def2/J RIJCOSX
keywords: DEFGRID2
keywords: scfconv7
keywords: smallprint printgap noloewdin
keywords: NOSOSCF
formula: C17H8Cl2F8N2O3
InChI: InChI=1/C17H8Cl2F8N2O3/c18-6-5-11(32-17(26,27)14(22)16(23,24)25)7(19)4-10(6)28-15(31)29-13(30)12-8(20)2-1-3-9(12)21/h1-5,14,28-29H
40 atoms
Cl 2.709452 -2.707719 -0.500475
Cl -0.641734 2.45903 0.17367
F  6.195414 -1.347749 0.23057
F  4.244624 1.254672 1.556904
F  4.096278 -0.87345 1.771579
F  6.083276 0.473949 -1.680911
F  7.835207 0.820342 -0.491998
F  6.130992 2.120486 -0.288838
F  -6.082361 1.478722 1.879278
F  -6.183885 -1.179159 -1.964112
O  3.772021 0.019885 -0.243763
O  -2.259317 -2.477276 -0.177401
O  -3.998454 1.257082 -0.049107
N  -1.78128 -0.240036 -0.083888
N  -3.969138 -1.019359 -0.068296
C  5.971384 -0.05547 0.630375
C  4.476001 0.09148 0.914325
C  2.400577 -0.056421 -0.163782
C  -0.393684 -0.234399 -0.116491
C  6.50251 0.855227 -0.477539
C  1.770355 -1.28345 -0.286925
C  1.641824 1.089059 -0.026861
C  0.265005 0.997485 -0.002554
C  0.390578 -1.376744 -0.270013
C  -2.601734 -1.31399 -0.116936
C  -6.07655 0.141984 -0.037813
C  -4.589686 0.192658 -0.06078
C  -6.778304 0.840381 0.938005
C  -6.830052 -0.518882 -0.998961
C  -8.154711 0.873828 0.982483
C  -8.20848 -0.497994 -1.007083
C  -8.861735 0.201607 -0.003793
H  6.523923 0.146146 1.552888
H  2.122965 2.055254 0.037158
H  -0.067306 -2.345859 -0.37339
H  -2.251256 0.661436 -0.029414
H  -4.548682 -1.849494 -0.041967
H  -8.661455 1.414673 1.769809
H  -8.757331 -1.014055 -1.782702
H  -9.942378 0.224769 0.009985
elementType: Cl F O N C H
totalener: -2707.27071339 hartree
nucrepener: 3650.09836845 hartree
electener: -6357.36908183 hartree
twoeener: 4642.35951102 hartree
cpcmener: -0.03792300 hartree
kineticenergy: 2699.66769085 hartree
xcener: -195.747301514603 hartree
chargesum: -0.0000000
charge: -0.055868 -0.072213 -0.205460 -0.185669 -0.179524 -0.161037 -0.164561 -0.164255 -0.202840 -0.207307 -0.317793 -0.502655 -0.457421 -0.171588 -0.147039 0.116201 0.468050 0.166282 0.159362 0.461695 0.026206 -0.101905 -0.007714 -0.159493 0.437914 -0.133302 0.421258 0.299023 0.315701 -0.240255 -0.243573 -0.061736 0.137934 0.139080 0.144017 0.173354 0.196294 0.155123 0.155356 0.170359
qa: -0.0559 -0.0722 -0.2055 -0.1857 -0.1795 -0.1610 -0.1646 -0.1643 -0.2028 -0.2073 -0.3178 -0.5027 -0.4574 -0.1716 -0.1470 0.1162 0.4681 0.1663 0.1594 0.4617 0.0262 -0.1019 -0.0077 -0.1595 0.4379 -0.1333 0.4213 0.2990 0.3157 -0.2403 -0.2436 -0.0617 0.1379 0.1391 0.1440 0.1734 0.1963 0.1551 0.1554 0.1704
va: 1.2621 1.2550 1.0827 1.1225 1.1258 1.1495 1.1467 1.1512 1.0957 1.0881 2.1006 2.0050 2.0594 3.2340 3.2412 3.9738 4.3157 3.8650 3.8983 4.4757 4.0868 4.0704 3.9525 3.9974 4.3009 3.5553 4.0524 3.9531 3.9260 3.9545 3.9587 3.8073 1.0051 1.0168 1.0481 1.0971 1.0067 0.9998 0.9999 0.9834
dispcorr: -0.020535564 hartree
energy: -2707.291248952633
dipole: -47.51365 44.32047 -3.19318 -2.87453 3.28925 0.41473 0.55404 0.12545 0.67949
magnitude: 3.29091 au
magnitude: 8.36483 debye
