program: Orca
programVersion: 5.0.2
elementType: Cl Cl F F F F F F F F O O O N N C C C C C C C C C C C C C C C C C H H H H H H H H
charge: 0
multiplicity: 1
keywords: wb97x-d3
keywords: def2-TZVPP
keywords: def2/J RIJCOSX
keywords: DEFGRID2
keywords: scfconv7
keywords: smallprint printgap noloewdin
keywords: NOSOSCF
formula: C17H8Cl2F8N2O3
InChI: InChI=1/C17H8Cl2F8N2O3/c18-6-5-11(32-17(26,27)14(22)16(23,24)25)7(19)4-10(6)28-15(31)29-13(30)12-8(20)2-1-3-9(12)21/h1-5,14,28-29H
40 atoms
Cl 2.602365 -2.775076 0.192651
Cl -0.757169 2.36695 1.00639
F  6.158493 -1.105361 0.58797
F  4.211855 -0.413885 -1.211657
F  4.136918 1.587152 -0.437078
F  6.767423 2.023399 -0.888438
F  6.892474 0.073872 -1.797083
F  8.146922 0.560169 -0.122161
F  -6.382756 -1.254542 1.742098
F  -6.00133 1.578597 -1.938278
O  3.652873 -0.114164 0.923947
O  -2.331989 -2.424436 -0.293471
O  -4.106663 1.24992 0.349904
N  -1.874863 -0.253429 0.273192
N  -4.043766 -0.974246 -0.142919
C  5.887678 0.219865 0.359169
C  4.433992 0.316978 -0.103557
C  2.290411 -0.152802 0.718978
C  -0.493294 -0.273857 0.412204
C  6.92839 0.726876 -0.637354
C  1.667867 -1.344936 0.387637
C  1.525699 0.981943 0.910722
C  0.155553 0.91978 0.756903
C  0.293766 -1.411186 0.240917
C  -2.682375 -1.285513 -0.060244
C  -6.153885 0.151995 -0.102042
C  -4.675548 0.212857 0.066786
C  -6.967529 -0.582609 0.746312
C  -6.774814 0.870888 -1.112089
C  -8.338644 -0.620225 0.608608
C  -8.139795 0.853476 -1.300455
C  -8.913279 0.100175 -0.428564
H  5.997203 0.784713 1.289708
H  1.995885 1.910695 1.203312
H  -0.157103 -2.355851 -0.011403
H  -2.34549 0.636689 0.422465
H  -4.615482 -1.766729 -0.411175
H  -8.942752 -1.198053 1.294433
H  -8.588535 1.411842 -2.110435
H  -9.986169 0.076411 -0.559039
elementType: Cl F O N C H
totalener: -2707.27035913 hartree
nucrepener: 3619.70779167 hartree
electener: -6326.97815080 hartree
twoeener: 4611.63805646 hartree
cpcmener: -0.03847473 hartree
kineticenergy: 2699.66141601 hartree
xcener: -195.744777776823 hartree
chargesum: 0.0000000
charge: -0.055829 -0.072703 -0.207899 -0.180424 -0.183641 -0.162252 -0.163186 -0.164305 -0.207482 -0.204577 -0.312160 -0.501540 -0.453587 -0.170663 -0.145913 0.123807 0.458861 0.159181 0.162473 0.458293 0.025839 -0.091945 -0.012017 -0.164440 0.438709 -0.130704 0.409086 0.320783 0.306249 -0.247480 -0.249325 -0.062092 0.141505 0.139655 0.145045 0.173258 0.201583 0.154639 0.155116 0.170079
qa: -0.0558 -0.0727 -0.2079 -0.1804 -0.1836 -0.1623 -0.1632 -0.1643 -0.2075 -0.2046 -0.3122 -0.5015 -0.4536 -0.1707 -0.1459 0.1238 0.4589 0.1592 0.1625 0.4583 0.0258 -0.0919 -0.0120 -0.1644 0.4387 -0.1307 0.4091 0.3208 0.3062 -0.2475 -0.2493 -0.0621 0.1415 0.1397 0.1450 0.1733 0.2016 0.1546 0.1551 0.1701
va: 1.2611 1.2546 1.0750 1.1270 1.1260 1.1513 1.1493 1.1475 1.0872 1.0942 2.1062 2.0066 2.0619 3.2351 3.2327 3.9693 4.3359 3.8771 3.8979 4.4801 4.0693 4.0514 3.9529 3.9922 4.2988 3.5528 4.0595 3.9271 3.9551 3.9644 3.9625 3.8031 1.0072 1.0160 1.0490 1.0958 1.0018 1.0000 0.9999 0.9834
dispcorr: -0.020244184 hartree
energy: -2707.290603317557
dipole: -49.68836 46.24022 -3.44813 -2.76607 3.38097 0.61490 3.22812 -2.69434 0.53378
magnitude: 3.54297 au
magnitude: 9.00552 debye
