program: Orca
programVersion: 5.0.2
elementType: Cl Cl F F F F F F F F O O O N N C C C C C C C C C C C C C C C C C H H H H H H H H
charge: 0
multiplicity: 1
keywords: wb97x-d3
keywords: def2-TZVPP
keywords: def2/J RIJCOSX
keywords: DEFGRID2
keywords: scfconv7
keywords: smallprint printgap noloewdin
keywords: NOSOSCF
formula: C17H8Cl2F8N2O3
InChI: InChI=1/C17H8Cl2F8N2O3/c18-6-5-11(32-17(26,27)14(22)16(23,24)25)7(19)4-10(6)28-15(31)29-13(30)12-8(20)2-1-3-9(12)21/h1-5,14,28-29H
40 atoms
Cl 2.679835 -2.768066 0.486263
Cl -0.6111 2.284698 -0.92832
F  6.193286 -1.152476 0.826129
F  4.131763 1.687623 1.058287
F  3.99581 -0.226787 2.022539
F  6.182317 -0.003717 -1.584791
F  7.865867 0.682194 -0.44848
F  6.176342 1.983595 -0.745665
F  -5.977299 -1.043221 2.016094
F  -6.241105 1.437081 -1.936163
O  3.780219 -0.130072 -0.192504
O  -2.293438 -2.539929 -0.065718
O  -3.960961 1.220965 -0.239697
N  -1.782122 -0.314349 -0.225252
N  -3.982285 -1.051665 -0.124399
C  5.926449 0.191074 0.771173
C  4.413882 0.378424 0.894731
C  2.403664 -0.174909 -0.172147
C  -0.393879 -0.328384 -0.214414
C  6.535618 0.720426 -0.526567
C  1.756942 -1.36475 0.11939
C  1.658637 0.941473 -0.499124
C  0.28068 0.861593 -0.51803
C  0.375995 -1.447495 0.097062
C  -2.618985 -1.372437 -0.135404
C  -6.054906 0.170119 0.018958
C  -4.573731 0.175917 -0.119007
C  -6.711597 -0.420251 1.090858
C  -6.844226 0.850856 -0.900993
C  -8.079704 -0.363781 1.249054
C  -8.215997 0.92151 -0.793032
C  -8.824748 0.308314 0.292553
H  6.405083 0.696587 1.615571
H  2.151108 1.866754 -0.7647
H  -0.09372 -2.386262 0.338474
H  -2.239126 0.591105 -0.315092
H  -4.579596 -1.86905 -0.07985
H  -8.549094 -0.828465 2.105183
H  -8.795611 1.44586 -1.540165
H  -9.899493 0.359449 0.397138
elementType: Cl F O N C H
totalener: -2707.27096269 hartree
nucrepener: 3648.66677899 hartree
electener: -6355.93774169 hartree
twoeener: 4640.88452215 hartree
cpcmener: -0.03841859 hartree
kineticenergy: 2699.65356915 hartree
xcener: -195.744613684415 hartree
chargesum: 0.0000000
charge: -0.056750 -0.072560 -0.205677 -0.185611 -0.179792 -0.161369 -0.164750 -0.164037 -0.207201 -0.202828 -0.317428 -0.502151 -0.456004 -0.176228 -0.150483 0.116416 0.468933 0.159559 0.168097 0.460434 0.028701 -0.096022 -0.012327 -0.159400 0.437063 -0.131718 0.419858 0.310248 0.304665 -0.240946 -0.242573 -0.061511 0.139227 0.140023 0.141126 0.174688 0.198396 0.155288 0.154494 0.170147
qa: -0.0568 -0.0726 -0.2057 -0.1856 -0.1798 -0.1614 -0.1648 -0.1640 -0.2072 -0.2028 -0.3174 -0.5022 -0.4560 -0.1762 -0.1505 0.1164 0.4689 0.1596 0.1681 0.4604 0.0287 -0.0960 -0.0123 -0.1594 0.4371 -0.1317 0.4199 0.3102 0.3047 -0.2409 -0.2426 -0.0615 0.1392 0.1400 0.1411 0.1747 0.1984 0.1553 0.1545 0.1701
va: 1.2597 1.2546 1.0826 1.1231 1.1259 1.1494 1.1467 1.1510 1.0879 1.0957 2.1043 2.0051 2.0598 3.2272 3.2367 3.9763 4.3158 3.8776 3.8717 4.4756 4.0832 4.0559 3.9586 4.0177 4.3043 3.5541 4.0545 3.9266 3.9516 3.9562 3.9565 3.8078 1.0046 1.0161 1.0454 1.0959 1.0052 0.9998 1.0002 0.9834
dispcorr: -0.020528362 hartree
energy: -2707.291491054379
dipole: -47.53223 44.28711 -3.24512 -2.58930 3.25299 0.66369 1.13290 -0.51284 0.62006
magnitude: 3.36983 au
magnitude: 8.56543 debye
