program: Orca
programVersion: 5.0.2
elementType: Cl Cl F F F F F F F F O O O N N C C C C C C C C C C C C C C C C C H H H H H H H H
charge: 0
multiplicity: 1
keywords: wb97x-d3
keywords: def2-TZVPP
keywords: def2/J RIJCOSX
keywords: DEFGRID2
keywords: scfconv7
keywords: smallprint printgap noloewdin
keywords: NOSOSCF
formula: C17H8Cl2F8N2O3
InChI: InChI=1/C17H8Cl2F8N2O3/c18-6-5-11(32-17(26,27)14(22)16(23,24)25)7(19)4-10(6)28-15(31)29-13(30)12-8(20)2-1-3-9(12)21/h1-5,14,28-29H
40 atoms
Cl 2.647516 -2.823276 0.620638
Cl -0.597835 2.393067 -0.175715
F  6.683348 0.102898 -1.6250
F  4.151049 -1.071117 -1.665119
F  4.236877 1.061867 -1.520839
F  6.045454 2.03647 0.405517
F  7.782119 0.792016 0.637792
F  6.015961 0.396224 1.80167
F  -6.086522 -1.504639 -1.732842
F  -6.185696 1.803592 1.561719
O  3.767886 -0.120386 0.317255
O  -2.314953 -2.426106 0.734275
O  -3.988599 1.208739 -0.256619
N  -1.793522 -0.27701 0.144887
N  -3.998698 -0.993766 0.317907
C  5.975294 -0.180282 -0.485143
C  4.48842 -0.068607 -0.831494
C  2.395313 -0.173157 0.225464
C  -0.40524 -0.296008 0.184855
C  6.451131 0.782137 0.604674
C  1.739156 -1.383693 0.376457
C  1.657721 0.982042 0.05551
C  0.279079 0.917907 0.034672
C  0.357343 -1.449698 0.360984
C  -2.636371 -1.299129 0.417022
C  -6.08455 0.139208 -0.072593
C  -4.596756 0.180777 -0.023001
C  -6.785277 -0.685849 -0.941464
C  -6.834522 1.005077 0.712939
C  -8.160645 -0.670121 -1.03382
C  -8.210502 1.049185 0.664623
C  -8.865026 0.203397 -0.219041
H  6.191356 -1.203482 -0.163102
H  2.156462 1.937345 -0.032448
H  -0.118196 -2.40887 0.477555
H  -2.243351 0.609552 -0.074944
H  -4.597532 -1.777517 0.549706
H  -8.668442 -1.322374 -1.730931
H  -8.757465 1.729296 1.303097
H  -9.944221 0.228601 -0.275638
elementType: Cl F O N C H
totalener: -2707.27066998 hartree
nucrepener: 3638.38254756 hartree
electener: -6345.65321754 hartree
twoeener: 4630.17760312 hartree
cpcmener: -0.03676762 hartree
kineticenergy: 2699.64868422 hartree
xcener: -195.743451304224 hartree
chargesum: -0.0000000
charge: -0.055807 -0.071860 -0.208160 -0.178885 -0.185163 -0.165533 -0.163777 -0.161771 -0.207309 -0.203694 -0.323109 -0.501237 -0.455947 -0.174754 -0.148362 0.130461 0.459697 0.173900 0.161468 0.464757 0.022835 -0.100013 -0.009158 -0.158283 0.437926 -0.132623 0.416508 0.313650 0.305285 -0.243908 -0.244438 -0.062724 0.131040 0.138905 0.143076 0.175493 0.200916 0.155751 0.154947 0.169900
qa: -0.0558 -0.0719 -0.2082 -0.1789 -0.1852 -0.1655 -0.1638 -0.1618 -0.2073 -0.2037 -0.3231 -0.5012 -0.4559 -0.1748 -0.1484 0.1305 0.4597 0.1739 0.1615 0.4648 0.0228 -0.1000 -0.0092 -0.1583 0.4379 -0.1326 0.4165 0.3136 0.3053 -0.2439 -0.2444 -0.0627 0.1310 0.1389 0.1431 0.1755 0.2009 0.1558 0.1549 0.1699
va: 1.2597 1.2553 1.0794 1.1244 1.1227 1.1486 1.1485 1.1484 1.0877 1.0949 2.0889 2.0063 2.0608 3.2321 3.2350 3.9659 4.3464 3.8611 3.8909 4.4623 4.0902 4.0655 3.9566 4.0061 4.3019 3.5537 4.0566 3.9294 3.9513 3.9587 3.9583 3.8066 1.0097 1.0167 1.0469 1.0941 1.0029 0.9996 1.0000 0.9836
dispcorr: -0.020482251 hartree
energy: -2707.291152234507
dipole: -48.15591 44.72429 -3.43163 -4.86857 4.34240 -0.52617 1.42140 -1.16857 0.25284
magnitude: 3.48092 au
magnitude: 8.84781 debye
