program: Orca
programVersion: 5.0.2
elementType: Cl Cl F F F F F F F F O O O N N C C C C C C C C C C C C C C C C C H H H H H H H H
charge: 0
multiplicity: 1
keywords: wb97x-d3
keywords: def2-TZVPP
keywords: def2/J RIJCOSX
keywords: DEFGRID2
keywords: scfconv7
keywords: smallprint printgap noloewdin
keywords: NOSOSCF
formula: C17H8Cl2F8N2O3
InChI: InChI=1/C17H8Cl2F8N2O3/c18-6-5-11(32-17(26,27)14(22)16(23,24)25)7(19)4-10(6)28-15(31)29-13(30)12-8(20)2-1-3-9(12)21/h1-5,14,28-29H
40 atoms
Cl 2.649433 -0.586661 -2.24257
Cl -0.59446 0.205184 2.985967
F  6.347267 -0.342489 1.296131
F  4.049079 1.702914 -0.4302
F  4.307792 1.455714 1.685336
F  5.81357 -1.248455 -1.234489
F  7.695708 -0.237068 -1.047608
F  6.046031 0.743487 -2.026813
F  -6.330081 0.184795 2.012555
F  -5.887997 0.112644 -2.634882
O  3.772889 -0.326014 0.461716
O  -2.244454 -2.008139 1.24645
O  -3.982105 1.177734 -0.712621
N  -1.770289 -0.042594 0.218662
N  -3.967017 -0.790571 0.435954
C  5.973886 0.547482 0.322782
C  4.479413 0.831155 0.500143
C  2.40106 -0.245915 0.423946
C  -0.375084 -0.156379 0.317235
C  6.373166 -0.062772 -1.019546
C  1.748916 -0.363236 -0.796596
C  1.674923 -0.099319 1.591409
C  0.29186 -0.047156 1.534855
C  0.36781 -0.33051 -0.841651
C  -2.601673 -1.002648 0.67131
C  -6.057959 0.13877 -0.307579
C  -4.572432 0.241699 -0.212897
C  -6.891761 0.1370 0.80091
C  -6.669657 0.118573 -1.554234
C  -8.266721 0.112232 0.695699
C  -8.038097 0.079537 -1.710624
C  -8.829648 0.079924 -0.571227
H  6.522596 1.485914 0.4526
H  2.185418 -0.034524 2.542629
H  -0.148864 -0.430233 -1.786965
H  -2.156128 0.712646 -0.338702
H  -4.551163 -1.549375 0.764904
H  -8.882731 0.122319 1.58458
H  -8.474208 0.049928 -2.700055
H  -9.905891 0.054914 -0.673398
elementType: Cl F O N C H
totalener: -2707.27995923 hartree
nucrepener: 3663.20463810 hartree
electener: -6370.48459733 hartree
twoeener: 4655.53139253 hartree
cpcmener: -0.03712895 hartree
kineticenergy: 2699.67010475 hartree
xcener: -195.739775481824 hartree
chargesum: -0.0000000
charge: -0.053978 -0.055331 -0.204222 -0.176082 -0.184113 -0.157817 -0.165220 -0.164302 -0.205743 -0.201993 -0.307801 -0.475553 -0.442334 -0.227699 -0.156923 0.127801 0.442934 0.186357 0.192289 0.458669 0.061441 -0.089015 -0.023040 -0.201119 0.397749 -0.141634 0.407294 0.313815 0.300864 -0.243599 -0.241250 -0.064362 0.136681 0.136947 0.136295 0.212856 0.199561 0.152493 0.152604 0.166481
qa: -0.0540 -0.0553 -0.2042 -0.1761 -0.1841 -0.1578 -0.1652 -0.1643 -0.2057 -0.2020 -0.3078 -0.4756 -0.4423 -0.2277 -0.1569 0.1278 0.4429 0.1864 0.1923 0.4587 0.0614 -0.0890 -0.0230 -0.2011 0.3977 -0.1416 0.4073 0.3138 0.3009 -0.2436 -0.2412 -0.0644 0.1367 0.1369 0.1363 0.2129 0.1996 0.1525 0.1526 0.1665
va: 1.2617 1.2635 1.0841 1.1286 1.1254 1.1531 1.1475 1.1490 1.0891 1.0974 2.1145 2.0454 2.0682 3.1165 3.1983 3.9761 4.3582 3.8489 3.6458 4.4721 4.0023 4.0722 4.0523 4.1801 4.3710 3.5428 4.0842 3.9372 3.9580 3.9587 3.9617 3.8103 1.0051 1.0196 1.0224 1.0318 1.0035 1.0008 1.0007 0.9850
dispcorr: -0.021121994 hartree
energy: -2707.301081227727
dipole: -47.09735 44.38439 -2.71296 -1.31333 2.03274 0.71942 1.10167 -1.49715 -0.39548
magnitude: 2.83445 au
magnitude: 7.20461 debye
