program: Orca
programVersion: 5.0.2
elementType: Cl Cl F F F F F F F F O O O N N C C C C C C C C C C C C C C C C C H H H H H H H H
charge: 0
multiplicity: 1
keywords: wb97x-d3
keywords: def2-TZVPP
keywords: def2/J RIJCOSX
keywords: DEFGRID2
keywords: scfconv7
keywords: smallprint printgap noloewdin
keywords: NOSOSCF
formula: C17H8Cl2F8N2O3
InChI: InChI=1/C17H8Cl2F8N2O3/c18-6-5-11(32-17(26,27)14(22)16(23,24)25)7(19)4-10(6)28-15(31)29-13(30)12-8(20)2-1-3-9(12)21/h1-5,14,28-29H
40 atoms
Cl 2.548742 -2.400432 -1.216745
Cl -0.73155 1.756267 2.00343
F  5.878131 -1.411319 -0.531646
F  4.090776 0.520133 -1.219425
F  4.445339 1.595439 0.6110
F  7.170694 1.744327 0.301816
F  6.78534 0.997173 -1.683292
F  8.144519 -0.047313 -0.390818
F  -6.443546 0.868258 2.155215
F  -6.03364 -0.498726 -2.287651
O  3.632934 -0.476305 0.716972
O  -2.358257 -2.415771 -0.155125
O  -4.134134 1.277069 0.315097
N  -1.88716 -0.197616 0.10325
N  -4.078706 -0.963517 -0.088736
C  5.88104 -0.227956 0.160448
C  4.471432 0.363581 0.060091
C  2.27793 -0.360553 0.519424
C  -0.501833 -0.279406 0.229208
C  7.00165 0.637104 -0.41929
C  1.634216 -1.237506 -0.341978
C  1.539448 0.567317 1.227596
C  0.164273 0.601844 1.084247
C  0.260502 -1.194129 -0.491713
C  -2.710669 -1.261189 -0.04997
C  -6.191292 0.177802 -0.060921
C  -4.706444 0.233941 0.072769
C  -7.014915 0.547431 0.993555
C  -6.810584 -0.160923 -1.25458
C  -8.3889 0.569788 0.887446
C  -8.179797 -0.140922 -1.413903
C  -8.961176 0.22561 -0.328426
H  6.10893 -0.420319 1.213933
H  2.029027 1.238692 1.919707
H  -0.2125 -1.866712 -1.189908
H  -2.333117 0.702354 0.259843
H  -4.658088 -1.78408 -0.217583
H  -8.99732 0.852032 1.736054
H  -8.623922 -0.402174 -2.36478
H  -10.037401 0.244376 -0.43121
elementType: Cl F O N C H
totalener: -2707.28234909 hartree
nucrepener: 3617.17223654 hartree
electener: -6324.45458563 hartree
twoeener: 4609.14633695 hartree
cpcmener: -0.03351446 hartree
kineticenergy: 2699.64644875 hartree
xcener: -195.738148522837 hartree
chargesum: -0.0000000
charge: -0.052698 -0.065912 -0.202689 -0.177417 -0.184357 -0.162773 -0.162164 -0.163031 -0.201467 -0.206331 -0.308395 -0.476788 -0.436471 -0.212053 -0.157160 0.118864 0.452674 0.152100 0.201340 0.461105 0.046843 -0.089480 -0.032367 -0.162729 0.422334 -0.132212 0.400018 0.306051 0.311120 -0.244793 -0.243576 -0.063997 0.137419 0.137843 0.130178 0.188218 0.200198 0.152472 0.153344 0.166735
qa: -0.0527 -0.0659 -0.2027 -0.1774 -0.1844 -0.1628 -0.1622 -0.1630 -0.2015 -0.2063 -0.3084 -0.4768 -0.4365 -0.2121 -0.1572 0.1189 0.4527 0.1521 0.2013 0.4611 0.0468 -0.0895 -0.0324 -0.1627 0.4223 -0.1322 0.4000 0.3061 0.3111 -0.2448 -0.2436 -0.0640 0.1374 0.1378 0.1302 0.1882 0.2002 0.1525 0.1533 0.1667
va: 1.2649 1.2600 1.0806 1.1270 1.1248 1.1499 1.1510 1.1493 1.0982 1.0884 2.1100 2.0374 2.0779 3.1996 3.2098 3.9745 4.3411 3.8844 3.7299 4.4751 4.0567 4.0503 4.0351 4.0920 4.3251 3.5445 4.0858 3.9585 3.9345 3.9610 3.9641 3.8100 1.0076 1.0183 1.0364 1.0682 1.0028 1.0010 1.0004 0.9847
dispcorr: -0.020457649 hartree
energy: -2707.302806733866
dipole: -49.84967 46.65579 -3.19388 -4.03401 4.11008 0.07606 2.62578 -2.04990 0.57588
magnitude: 3.24628 au
magnitude: 8.25138 debye
