program: Orca
programVersion: 5.0.2
elementType: Cl Cl F F F F F F F F O O O N N C C C C C C C C C C C C C C C C C H H H H H H H H
charge: 0
multiplicity: 1
keywords: wb97x-d3
keywords: def2-TZVPP
keywords: def2/J RIJCOSX
keywords: DEFGRID2
keywords: scfconv7
keywords: smallprint printgap noloewdin
keywords: NOSOSCF
formula: C17H8Cl2F8N2O3
InChI: InChI=1/C17H8Cl2F8N2O3/c18-6-5-11(32-17(26,27)14(22)16(23,24)25)7(19)4-10(6)28-15(31)29-13(30)12-8(20)2-1-3-9(12)21/h1-5,14,28-29H
40 atoms
Cl 2.855111 -2.011847 -1.166699
Cl -0.824032 2.65189 0.598659
F  6.655888 0.543822 1.600558
F  4.170272 1.591822 1.631242
F  4.171316 -0.54398 1.46809
F  7.781896 -0.330746 -0.618448
F  5.947525 -0.259814 -1.741078
F  6.16457 -1.646104 -0.104068
F  -6.147129 0.497171 2.372283
F  -6.132526 -0.583487 -2.169477
O  3.737904 0.670721 -0.354291
O  -2.107735 -2.163975 -0.921791
O  -4.100017 1.184028 0.436526
N  -1.781848 -0.013822 -0.204986
N  -3.905148 -0.949048 -0.335875
C  5.948742 0.666037 0.432382
C  4.462194 0.579044 0.786851
C  2.377897 0.485192 -0.28263
C  -0.400277 0.104962 -0.258555
C  6.455235 -0.415822 -0.521541
C  1.827791 -0.729041 -0.660201
C  1.543955 1.5191 0.096604
C  0.176483 1.328825 0.109124
C  0.457922 -0.919187 -0.657729
C  -2.525804 -1.101711 -0.514498
C  -6.087338 -0.047621 0.102237
C  -4.609955 0.138962 0.084542
C  -6.815294 0.179955 1.262935
C  -6.808545 -0.384264 -1.034939
C  -8.187403 0.060616 1.311603
C  -8.181764 -0.500004 -1.039568
C  -8.862312 -0.277839 0.147692
H  6.147111 1.645316 -0.0148
H  1.957396 2.482267 0.363011
H  0.063409 -1.874257 -0.961488
H  -2.306799 0.79181 0.129381
H  -4.420917 -1.794085 -0.548776
H  -8.717271 0.228519 2.239492
H  -8.705722 -0.754027 -1.951126
H  -9.939565 -0.36952 0.166809
elementType: Cl F O N C H
totalener: -2707.28328147 hartree
nucrepener: 3657.62230394 hartree
electener: -6364.90558541 hartree
twoeener: 4649.66800958 hartree
cpcmener: -0.03186780 hartree
kineticenergy: 2699.67224224 hartree
xcener: -195.746785681258 hartree
chargesum: -0.0000000
charge: -0.053730 -0.071041 -0.205587 -0.185028 -0.176316 -0.164610 -0.160433 -0.162866 -0.200372 -0.205863 -0.318818 -0.478089 -0.435726 -0.175695 -0.150498 0.132819 0.444778 0.162963 0.161883 0.459854 0.038019 -0.087196 -0.016654 -0.172234 0.426171 -0.132310 0.404896 0.303177 0.309182 -0.241283 -0.241343 -0.062023 0.131431 0.136244 0.145768 0.173829 0.194180 0.152017 0.153366 0.167136
qa: -0.0537 -0.0710 -0.2056 -0.1850 -0.1763 -0.1646 -0.1604 -0.1629 -0.2004 -0.2059 -0.3188 -0.4781 -0.4357 -0.1757 -0.1505 0.1328 0.4448 0.1630 0.1619 0.4599 0.0380 -0.0872 -0.0167 -0.1722 0.4262 -0.1323 0.4049 0.3032 0.3092 -0.2413 -0.2413 -0.0620 0.1314 0.1362 0.1458 0.1738 0.1942 0.1520 0.1534 0.1671
va: 1.2663 1.2559 1.0817 1.1217 1.1271 1.1476 1.1504 1.1495 1.0997 1.0895 2.1017 2.0346 2.0831 3.2321 3.2290 3.9673 4.3686 3.8389 3.8953 4.4623 4.0755 4.0741 3.9653 3.9879 4.3126 3.5519 4.0690 3.9591 3.9299 3.9596 3.9635 3.8107 1.0093 1.0166 1.0491 1.0953 1.0076 1.0011 1.0006 0.9847
dispcorr: -0.020815676 hartree
energy: -2707.304097146695
dipole: -48.03842 44.62136 -3.41707 0.13758 0.49825 0.63583 -2.06968 1.72517 -0.34451
magnitude: 3.49275 au
magnitude: 8.87786 debye
