program: Orca
programVersion: 5.0.2
elementType: Cl Cl F F F F F F F F O O O N N C C C C C C C C C C C C C C C C C H H H H H H H H
charge: 0
multiplicity: 1
keywords: wb97x-d3
keywords: def2-TZVPP
keywords: def2/J RIJCOSX
keywords: DEFGRID2
keywords: scfconv7
keywords: smallprint printgap noloewdin
keywords: NOSOSCF
formula: C17H8Cl2F8N2O3
InChI: InChI=1/C17H8Cl2F8N2O3/c18-6-5-11(32-17(26,27)14(22)16(23,24)25)7(19)4-10(6)28-15(31)29-13(30)12-8(20)2-1-3-9(12)21/h1-5,14,28-29H
40 atoms
Cl 2.632478 -2.830465 0.348641
Cl -0.582707 2.387021 -0.568159
F  6.224828 -1.289616 0.395581
F  4.233344 1.503576 1.188398
F  4.150595 -0.50191 1.95614
F  7.860648 0.617527 -0.655971
F  6.31211 2.106922 -0.490258
F  6.027746 0.378666 -1.745964
F  -6.122972 -0.908692 2.055173
F  -6.182691 1.240495 -2.091956
O  3.773338 -0.171409 -0.213576
O  -2.301105 -2.477827 -0.022328
O  -4.018249 1.274333 -0.11044
N  -1.791844 -0.247681 -0.043447
N  -3.995484 -1.000905 -0.035659
C  5.98643 0.042163 0.613062
C  4.488538 0.217918 0.867801
C  2.400913 -0.188068 -0.116183
C  -0.403131 -0.278158 -0.061905
C  6.540755 0.799392 -0.593314
C  1.736358 -1.380495 0.121035
C  1.668529 0.964856 -0.326092
C  0.288606 0.917848 -0.29713
C  0.354028 -1.430123 0.147496
C  -2.629712 -1.311499 -0.031893
C  -6.099939 0.159015 -0.02411
C  -4.60918 0.214585 -0.054184
C  -6.810817 -0.380635 1.038787
C  -6.841244 0.725731 -1.052802
C  -8.188769 -0.373237 1.091422
C  -8.219247 0.749687 -1.048389
C  -8.884204 0.19587 0.035656
H  6.526819 0.370888 1.50705
H  2.172549 1.897064 -0.542076
H  -0.128957 -2.373663 0.338818
H  -2.240646 0.66446 -0.086008
H  -4.582801 -1.826255 -0.044649
H  -8.704637 -0.798432 1.941668
H  -8.759804 1.190012 -1.875291
H  -9.965246 0.208927 0.057931
elementType: Cl F O N C H
totalener: -2707.28352884 hartree
nucrepener: 3640.06641331 hartree
electener: -6347.34994215 hartree
twoeener: 4632.14899426 hartree
cpcmener: -0.03215362 hartree
kineticenergy: 2699.64599791 hartree
xcener: -195.740481109283 hartree
chargesum: 0.0000000
charge: -0.054700 -0.071216 -0.203039 -0.184981 -0.178988 -0.164513 -0.163714 -0.159064 -0.205780 -0.201051 -0.312016 -0.476908 -0.436051 -0.179564 -0.152155 0.117708 0.462597 0.156292 0.167414 0.457710 0.033101 -0.094637 -0.016619 -0.161742 0.425940 -0.134073 0.403886 0.311836 0.304405 -0.243540 -0.244069 -0.062243 0.135189 0.137205 0.142773 0.174793 0.196949 0.153015 0.152630 0.167219
qa: -0.0547 -0.0712 -0.2030 -0.1850 -0.1790 -0.1645 -0.1637 -0.1591 -0.2058 -0.2011 -0.3120 -0.4769 -0.4361 -0.1796 -0.1522 0.1177 0.4626 0.1563 0.1674 0.4577 0.0331 -0.0946 -0.0166 -0.1617 0.4259 -0.1341 0.4039 0.3118 0.3044 -0.2435 -0.2441 -0.0622 0.1352 0.1372 0.1428 0.1748 0.1969 0.1530 0.1526 0.1672
va: 1.2614 1.2557 1.0850 1.1235 1.1274 1.1473 1.1509 1.1524 1.0893 1.0989 2.1135 2.0344 2.0830 3.2285 3.2235 3.9833 4.3266 3.8768 3.8739 4.4772 4.0819 4.0530 3.9661 4.0116 4.3127 3.5521 4.0738 3.9333 3.9578 3.9621 3.9619 3.8092 1.0055 1.0163 1.0471 1.0921 1.0054 1.0007 1.0008 0.9845
dispcorr: -0.020469802 hartree
energy: -2707.303998643487
dipole: -47.75847 44.67411 -3.08436 -2.97533 3.42262 0.44728 0.95099 -0.41672 0.53427
magnitude: 3.16208 au
magnitude: 8.03737 debye
