program: Orca
programVersion: 5.0.2
elementType: Cl Cl F F F F F F F F O O O N N C C C C C C C C C C C C C C C C C H H H H H H H H
charge: 0
multiplicity: 1
keywords: wb97x-d3
keywords: def2-TZVPP
keywords: def2/J RIJCOSX
keywords: DEFGRID2
keywords: scfconv7
keywords: smallprint printgap noloewdin
keywords: NOSOSCF
formula: C17H8Cl2F8N2O3
InChI: InChI=1/C17H8Cl2F8N2O3/c18-6-5-11(32-17(26,27)14(22)16(23,24)25)7(19)4-10(6)28-15(31)29-13(30)12-8(20)2-1-3-9(12)21/h1-5,14,28-29H
40 atoms
Cl 2.733266 -2.310473 1.30982
Cl -0.689797 2.050921 -1.455882
F  5.996776 -0.863759 1.213255
F  4.371003 2.038058 0.066005
F  3.963768 0.786401 1.766924
F  6.168336 -0.833983 -1.457183
F  7.937735 -0.022526 -0.559396
F  6.518978 1.294477 -1.503038
F  -6.112959 -2.148951 -0.874786
F  -6.19693 2.29687 0.576838
O  3.757704 -0.078445 -0.271733
O  -2.25077 -2.036867 1.369774
O  -4.024664 1.022656 -0.744356
N  -1.794239 -0.203682 0.075355
N  -3.9753 -0.839402 0.561619
C  5.933423 0.353448 0.586708
C  4.461796 0.768171 0.5168
C  2.387547 -0.084319 -0.15604
C  -0.407313 -0.209489 0.030478
C  6.637645 0.196049 -0.760228
C  1.770864 -1.104654 0.54984
C  1.613287 0.878253 -0.77411
C  0.237036 0.816333 -0.675538
C  0.392471 -1.17775 0.637336
C  -2.603954 -1.083661 0.70939
C  -6.094413 0.070247 -0.134707
C  -4.606814 0.137389 -0.148806
C  -6.803239 -1.060718 -0.520643
C  -6.843119 1.194645 0.197164
C  -8.180285 -1.095111 -0.574412
C  -8.220993 1.202051 0.173197
C  -8.881164 0.047078 -0.219227
H  6.472896 1.100639 1.177742
H  2.07833 1.668202 -1.348019
H  -0.054209 -1.988401 1.188576
H  -2.273879 0.546176 -0.419806
H  -4.545624 -1.492482 1.083515
H  -8.691445 -1.993386 -0.893216
H  -8.765423 2.092974 0.455721
H  -9.96198 0.038285 -0.250459
elementType: Cl F O N C H
totalener: -2707.28314170 hartree
nucrepener: 3646.14842216 hartree
electener: -6353.43156386 hartree
twoeener: 4638.38418809 hartree
cpcmener: -0.03187834 hartree
kineticenergy: 2699.65748811 hartree
xcener: -195.743884577308 hartree
chargesum: 0.0000000
charge: -0.054038 -0.071283 -0.201926 -0.186195 -0.178790 -0.158727 -0.164512 -0.162636 -0.206077 -0.199384 -0.314908 -0.478257 -0.436440 -0.175495 -0.150506 0.120396 0.460061 0.147125 0.162898 0.456271 0.040367 -0.091844 -0.016671 -0.165412 0.424943 -0.133524 0.407285 0.308624 0.301326 -0.239814 -0.238283 -0.062441 0.137738 0.137382 0.144614 0.172292 0.192821 0.153182 0.152411 0.167427
qa: -0.0540 -0.0713 -0.2019 -0.1862 -0.1788 -0.1587 -0.1645 -0.1626 -0.2061 -0.1994 -0.3149 -0.4783 -0.4364 -0.1755 -0.1505 0.1204 0.4601 0.1471 0.1629 0.4563 0.0404 -0.0918 -0.0167 -0.1654 0.4249 -0.1335 0.4073 0.3086 0.3013 -0.2398 -0.2383 -0.0624 0.1377 0.1374 0.1446 0.1723 0.1928 0.1532 0.1524 0.1674
va: 1.2654 1.2561 1.0863 1.1222 1.1238 1.1527 1.1469 1.1528 1.0893 1.1005 2.1115 2.0348 2.0818 3.2302 3.2328 3.9810 4.3230 3.8787 3.8942 4.4844 4.0739 4.0725 3.9666 3.9976 4.3151 3.5520 4.0665 3.9290 3.9590 3.9606 3.9571 3.8129 1.0052 1.0182 1.0494 1.0987 1.0089 1.0007 1.0010 0.9846
dispcorr: -0.020557542 hartree
energy: -2707.303699242631
dipole: -47.92061 44.73942 -3.18119 -2.03334 2.65101 0.61768 1.79747 -1.60451 0.19296
magnitude: 3.24634 au
magnitude: 8.25155 debye
