program: Orca
programVersion: 5.0.2
elementType: Cl Cl F F F F F F F F O O O N N C C C C C C C C C C C C C C C C C H H H H H H H H
charge: 0
multiplicity: 1
keywords: wb97x-d3
keywords: def2-TZVPP
keywords: def2/J RIJCOSX
keywords: DEFGRID2
keywords: scfconv7
keywords: smallprint printgap noloewdin
keywords: NOSOSCF
formula: C17H8Cl2F8N2O3
InChI: InChI=1/C17H8Cl2F8N2O3/c18-6-5-11(32-17(26,27)14(22)16(23,24)25)7(19)4-10(6)28-15(31)29-13(30)12-8(20)2-1-3-9(12)21/h1-5,14,28-29H
40 atoms
Cl 2.702177 -2.302659 1.404394
Cl -0.61578 2.078797 -1.455219
F  6.248352 -0.692792 1.324112
F  4.30621 2.055364 0.360082
F  4.088575 0.637094 1.961815
F  7.850049 0.236377 -0.803886
F  6.097806 1.172845 -1.639488
F  6.140334 -0.959454 -1.312217
F  -6.235407 0.110276 -2.502007
F  -6.081828 -0.01503 2.16513
O  3.785299 -0.056816 -0.132983
O  -2.243597 -2.210096 1.003744
O  -4.050492 1.078874 -0.737563
N  -1.77457 -0.200203 0.003823
N  -3.963005 -0.940029 0.31227
C  5.988511 0.435756 0.603424
C  4.490261 0.753327 0.686662
C  2.41442 -0.058076 -0.044367
C  -0.384111 -0.193838 0.017529
C  6.515464 0.209898 -0.817844
C  1.773814 -1.087505 0.626623
C  1.661954 0.910493 -0.680501
C  0.282538 0.844872 -0.645932
C  0.392297 -1.161588 0.654098
C  -2.584516 -1.180591 0.475356
C  -6.100845 0.0429 -0.170727
C  -4.608869 0.13343 -0.232642
C  -6.863067 0.081952 -1.331626
C  -6.789336 0.000648 1.033652
C  -8.242849 0.060809 -1.308423
C  -8.16726 -0.013487 1.103712
C  -8.885545 0.015366 -0.080985
H  6.531452 1.278103 1.044912
H  2.147213 1.706895 -1.226319
H  -0.078091 -1.978693 1.174725
H  -2.239205 0.588855 -0.439354
H  -4.521308 -1.697552 0.67673
H  -8.797823 0.080163 -2.235533
H  -8.661036 -0.040534 2.064837
H  -9.966073 0.002727 -0.047336
totalener: -2707.25998133 hartree
nucrepener: 3644.12236556 hartree
electener: -6351.38234689 hartree
twoeener: 4635.96689744 hartree
kineticenergy: 2699.70170654 hartree
xcener: -195.743746593376 hartree
chargesum: 0.0000000
charge: -0.033867 -0.057559 -0.180068 -0.185976 -0.164398 -0.159795 -0.158102 -0.143140 -0.176570 -0.187857 -0.303372 -0.399741 -0.358785 -0.196522 -0.176349 0.097094 0.458785 0.152952 0.141166 0.455223 0.034105 -0.098508 -0.021291 -0.149364 0.398354 -0.157096 0.374165 0.297758 0.274995 -0.223710 -0.222558 -0.043433 0.093879 0.122298 0.147224 0.177390 0.169586 0.131421 0.132975 0.138693
qa: -0.0339 -0.0576 -0.1801 -0.1860 -0.1644 -0.1598 -0.1581 -0.1431 -0.1766 -0.1879 -0.3034 -0.3997 -0.3588 -0.1965 -0.1763 0.0971 0.4588 0.1530 0.1412 0.4552 0.0341 -0.0985 -0.0213 -0.1494 0.3984 -0.1571 0.3742 0.2978 0.2750 -0.2237 -0.2226 -0.0434 0.0939 0.1223 0.1472 0.1774 0.1696 0.1314 0.1330 0.1387
va: 1.2839 1.2704 1.1141 1.1179 1.1461 1.1512 1.1584 1.1763 1.1341 1.1103 2.1169 2.1080 2.1538 3.2348 3.2011 4.0163 4.3158 3.8795 3.9014 4.4888 4.1038 4.0802 4.0095 3.9912 4.3104 3.5780 4.0926 4.0068 3.9854 3.9935 3.9949 3.8480 1.0137 1.0247 1.0479 1.0909 1.0262 1.0090 1.0082 0.9956
dispcorr: -0.020537142 hartree
energy: -2707.280518472575
dipole: -47.62030 45.02258 -2.59772 -2.12306 2.53562 0.41256 1.41556 -1.34246 0.07310
magnitude: 2.63129 au
magnitude: 6.68822 debye
